BDBM75933 SR-02000000469::SR-02000000469-1::[1-(2,3-dichlorobenzyl)-2-piperidyl]-[4-(4-nitrophenyl)piperazino]methanone::[1-[(2,3-dichlorophenyl)methyl]-2-piperidinyl]-[4-(4-nitrophenyl)-1-piperazinyl]methanone::[1-[(2,3-dichlorophenyl)methyl]piperidin-2-yl]-[4-(4-nitrophenyl)piperazin-1-yl]methanone::[1-[[2,3-bis(chloranyl)phenyl]methyl]piperidin-2-yl]-[4-(4-nitrophenyl)piperazin-1-yl]methanone::cid_46846316
SMILES [O-][N+](=O)c1ccc(cc1)N1CCN(CC1)C(=O)C1CCCCN1Cc1cccc(Cl)c1Cl
InChI Key InChIKey=KLDKTKSMXWACNX-UHFFFAOYSA-N
Data  2 IC50
  Tab Delimited (TSV)   2D SDfile   Computed 3D by Vconf -m prep SDfile
Find this compound or compounds like it in BindingDB:
Activity Spreadsheet -- Enzyme Inhibition Constant Data from BindingDB
Found 2 hits for monomerid = 75933
TargetNeuropeptides B/W receptor type 1(Homo sapiens (Human))
The Scripps Research Institute Molecular Screening Center
Curated by PubChem BioAssay
LigandPNGBDBM75933(SR-02000000469 | SR-02000000469-1 | [1-(2,3-dichlo...)
Affinity DataIC50:  4.40E+3nM. Assay description: Source (MLPCN Center Name): The Scripps Research Institute Molecular Screening Center (SRIMSC) Affiliation: The Scripps Research Institute, TSRI Assa...
In DepthDetails PCBioAssay
TargetMelanin-concentrating hormone receptor 1(Homo sapiens (Human))
The Scripps Research Institute Molecular Screening Center
Curated by PubChem BioAssay
LigandPNGBDBM75933(SR-02000000469 | SR-02000000469-1 | [1-(2,3-dichlo...)
Affinity DataIC50:  3.30E+3nM. Assay description: Source (MLPCN Center Name): The Scripps Research Institute Molecular Screening Center (SRIMSC) Affiliation: The Scripps Research Institute, TSRI Assa...
In DepthDetails PCBioAssay