BDBM75939 4-(4-methoxyphenoxy)-2-(4-methylphenyl)-5-phenyl-3-pyridazinone::4-(4-methoxyphenoxy)-2-(4-methylphenyl)-5-phenyl-pyridazin-3-one::4-(4-methoxyphenoxy)-2-(4-methylphenyl)-5-phenylpyridazin-3-one::4-(4-methoxyphenoxy)-5-phenyl-2-(p-tolyl)pyridazin-3-one::SR-02000000475::SR-02000000475-1::cid_46846334
SMILES COc1ccc(Oc2c(cnn(-c3ccc(C)cc3)c2=O)-c2ccccc2)cc1
InChI Key InChIKey=SZIOINAURCPGPT-UHFFFAOYSA-N
Data  3 IC50
  Tab Delimited (TSV)   2D SDfile   Computed 3D by Vconf -m prep SDfile
Find this compound or compounds like it in BindingDB:
Activity Spreadsheet -- Enzyme Inhibition Constant Data from BindingDB
Found 3 hits for monomerid = 75939
TargetMelanin-concentrating hormone receptor 1(Homo sapiens (Human))
The Scripps Research Institute Molecular Screening Center
Curated by PubChem BioAssay
LigandPNGBDBM75939(4-(4-methoxyphenoxy)-2-(4-methylphenyl)-5-phenyl-3...)
Affinity DataIC50:  2.00E+4nM. Assay description: Source (MLPCN Center Name): The Scripps Research Institute Molecular Screening Center (SRIMSC) Affiliation: The Scripps Research Institute, TSRI Assa...
In DepthDetails PCBioAssay
TargetNeuropeptides B/W receptor type 1(Homo sapiens (Human))
The Scripps Research Institute
Curated by ChEMBL
LigandPNGBDBM75939(4-(4-methoxyphenoxy)-2-(4-methylphenyl)-5-phenyl-3...)
Affinity DataIC50: >2.00E+4nM. Assay description: Antagonist activity at human NPBWR1 expressed in HEK293T cells co-expressing Galphaqi3 assessed as calcium release after 15 mins by FLIPR assay assay
In DepthDetails ArticlePubMed
TargetNeuropeptides B/W receptor type 1(Homo sapiens (Human))
The Scripps Research Institute
Curated by ChEMBL
LigandPNGBDBM75939(4-(4-methoxyphenoxy)-2-(4-methylphenyl)-5-phenyl-3...)
Affinity DataIC50: >2.00E+4nM. Assay description: Source (MLPCN Center Name): The Scripps Research Institute Molecular Screening Center (SRIMSC) Affiliation: The Scripps Research Institute, TSRI Assa...
In DepthDetails PCBioAssay