BDBM75974 2-(2-Phenyl-quinazolin-4-ylsulfanyl)-N-thiazol-2-yl-acetamide::2-(2-phenylquinazolin-4-yl)sulfanyl-N-(1,3-thiazol-2-yl)acetamide::2-(2-phenylquinazolin-4-yl)sulfanyl-N-(1,3-thiazol-2-yl)ethanamide::2-[(2-phenyl-4-quinazolinyl)thio]-N-(2-thiazolyl)acetamide::2-[(2-phenylquinazolin-4-yl)thio]-N-thiazol-2-yl-acetamide::MLS000552333::SMR000178111::cid_1072346
SMILES O=C(CSc1nc(nc2ccccc12)-c1ccccc1)Nc1nccs1
InChI Key InChIKey=ZJQDZYGXORTRFV-UHFFFAOYSA-N
Data  2 IC50  3 EC50
  Tab Delimited (TSV)   2D SDfile   Computed 3D by Vconf -m prep SDfile
Find this compound or compounds like it in BindingDB:
Activity Spreadsheet -- Enzyme Inhibition Constant Data from BindingDB
Found 5 hits for monomerid = 75974
TargetIsoform 2 of Nuclear receptor corepressor 2 (TRAC-1)(Homo sapiens (Human))
The Scripps Research Institute Molecular Screening Center
Curated by PubChem BioAssay
LigandPNGBDBM75974(2-(2-Phenyl-quinazolin-4-ylsulfanyl)-N-thiazol-2-y...)
Affinity DataIC50: >3.98E+4nM. Assay description: Source (MLPCN Center Name): The Scripps Research Institute Molecular Screening Center Affiliation: The Scripps Research Institute, TSRI Assay Provide...
In DepthDetails PCBioAssay
TargetPhotoreceptor-specific nuclear receptor(Homo sapiens (Human))
The Scripps Research Institute Molecular Screening Center
Curated by PubChem BioAssay
LigandPNGBDBM75974(2-(2-Phenyl-quinazolin-4-ylsulfanyl)-N-thiazol-2-y...)
Affinity DataIC50:  5.93E+3nM. Assay description: Source (MLPCN Center Name): The Scripps Research Institute Molecular Screening Center Affiliation: The Scripps Research Institute, TSRI Assay Provide...
In DepthDetails PCBioAssay
TargetEndoribonuclease toxin MazF(Escherichia coli str. K-12 substr. MG1655)
Burnham Center For Chemical Genomics
Curated by PubChem BioAssay
LigandPNGBDBM75974(2-(2-Phenyl-quinazolin-4-ylsulfanyl)-N-thiazol-2-y...)
Affinity DataEC50:  2.91E+4nM. Assay description: Data Source: Sanford-Burnham Center for Chemical Genomics (SBCCG) Source Affiliation: Sanford-Burnham Medical Research Institute (SBMRI, San Diego, C...
In DepthDetails PCBioAssay
TargetEndoribonuclease toxin MazF(Escherichia coli str. K-12 substr. MG1655)
Burnham Center For Chemical Genomics
Curated by PubChem BioAssay
LigandPNGBDBM75974(2-(2-Phenyl-quinazolin-4-ylsulfanyl)-N-thiazol-2-y...)
Affinity DataEC50:  4.50E+4nM. Assay description: Data Source: Sanford-Burnham Center for Chemical Genomics (SBCCG) Source Affiliation: Sanford-Burnham Medical Research Institute (SBMRI, San Diego, C...
In DepthDetails PCBioAssay
TargetEndoribonuclease toxin MazF(Escherichia coli str. K-12 substr. MG1655)
Burnham Center For Chemical Genomics
Curated by PubChem BioAssay
LigandPNGBDBM75974(2-(2-Phenyl-quinazolin-4-ylsulfanyl)-N-thiazol-2-y...)
Affinity DataEC50:  2.07E+4nM. Assay description: Data Source: Sanford-Burnham Center for Chemical Genomics (SBCCG) Source Affiliation: Sanford-Burnham Medical Research Institute (SBMRI, San Diego, C...
In DepthDetails PCBioAssay