BDBM76004 3-(4-bromophenyl)sulfonyl-N-(4-ethoxyphenyl)propanamide::3-[(4-bromophenyl)sulfonyl]-N-(4-ethoxyphenyl)propanamide::3-brosyl-N-p-phenetyl-propionamide::MLS001202241::SMR000564968::cid_4293409
SMILES CCOc1ccc(NC(=O)CCS(=O)(=O)c2ccc(Br)cc2)cc1
InChI Key InChIKey=OZJLKNIDDOWSSZ-UHFFFAOYSA-N
Data  2 IC50
  Tab Delimited (TSV)   2D SDfile   Computed 3D by Vconf -m prep SDfile
Find this compound or compounds like it in BindingDB:
Activity Spreadsheet -- Enzyme Inhibition Constant Data from BindingDB
Found 2 hits for monomerid = 76004
TargetPhotoreceptor-specific nuclear receptor(Homo sapiens (Human))
The Scripps Research Institute Molecular Screening Center
Curated by PubChem BioAssay
LigandPNGBDBM76004(3-(4-bromophenyl)sulfonyl-N-(4-ethoxyphenyl)propan...)
Affinity DataIC50:  8.87E+3nM. Assay description: Source (MLPCN Center Name): The Scripps Research Institute Molecular Screening Center Affiliation: The Scripps Research Institute, TSRI Assay Provide...
In DepthDetails PCBioAssay
TargetIsoform 2 of Nuclear receptor corepressor 2 (TRAC-1)(Homo sapiens (Human))
The Scripps Research Institute Molecular Screening Center
Curated by PubChem BioAssay
LigandPNGBDBM76004(3-(4-bromophenyl)sulfonyl-N-(4-ethoxyphenyl)propan...)
Affinity DataIC50:  1.36E+4nM. Assay description: Source (MLPCN Center Name): The Scripps Research Institute Molecular Screening Center Affiliation: The Scripps Research Institute, TSRI Assay Provide...
In DepthDetails PCBioAssay