BDBM76064 2-(3-bromophenyl)-7-methyl-4-(1-naphthalenyl)pyrazolo[3,4-d]pyridazine::2-(3-bromophenyl)-7-methyl-4-(1-naphthyl)pyrazolo[3,4-d]pyridazine::2-(3-bromophenyl)-7-methyl-4-naphthalen-1-yl-pyrazolo[3,4-d]pyridazine::2-(3-bromophenyl)-7-methyl-4-naphthalen-1-ylpyrazolo[3,4-d]pyridazine::MLS-0437170.0001::cid_1214651
SMILES Cc1nnc(-c2cccc3ccccc23)c2cn(nc12)-c1cccc(Br)c1
InChI Key InChIKey=GPQAMKRDGHYJDR-UHFFFAOYSA-N
Data  4 IC50  3 EC50
  Tab Delimited (TSV)   2D SDfile   Computed 3D by Vconf -m prep SDfile
Find this compound or compounds like it in BindingDB:
Activity Spreadsheet -- Enzyme Inhibition Constant Data from BindingDB
Found 7 hits for monomerid = 76064
TargetCannabinoid receptor 2(Homo sapiens (Human))
Burnham Center For Chemical Genomics
Curated by PubChem BioAssay
LigandPNGBDBM76064(2-(3-bromophenyl)-7-methyl-4-(1-naphthalenyl)pyraz...)
Affinity DataEC50: >3.20E+4nM. Assay description: Data Source: Sanford-Burnham Center for Chemical Genomics Source Affiliation: Sanford-Burnham Medical Research Institute (SBMRI, San Diego, CA) Netw...
In DepthDetails PCBioAssay
TargetCannabinoid receptor 2(Homo sapiens (Human))
Burnham Center For Chemical Genomics
Curated by PubChem BioAssay
LigandPNGBDBM76064(2-(3-bromophenyl)-7-methyl-4-(1-naphthalenyl)pyraz...)
Affinity DataIC50:  3.87E+3nM. Assay description: Data Source: Sanford-Burnham Center for Chemical Genomics Source Affiliation: Sanford-Burnham Medical Research Institute (SBMRI, San Diego, CA) Netw...
In DepthDetails PCBioAssay
TargetCannabinoid receptor 1(Homo sapiens (Human))
Burnham Center For Chemical Genomics
Curated by PubChem BioAssay
LigandPNGBDBM76064(2-(3-bromophenyl)-7-methyl-4-(1-naphthalenyl)pyraz...)
Affinity DataEC50: >3.20E+4nM. Assay description: Data Source: Sanford-Burnham Center for Chemical Genomics Source Affiliation: Sanford-Burnham Medical Research Institute (SBMRI, San Diego) Network...
In DepthDetails PCBioAssay
TargetG-protein coupled receptor 55(Homo sapiens (Human))
Burnham Center For Chemical Genomics
Curated by PubChem BioAssay
LigandPNGBDBM76064(2-(3-bromophenyl)-7-methyl-4-(1-naphthalenyl)pyraz...)
Affinity DataIC50:  5.27E+3nM. Assay description: Data Source: Sanford-Burnham Center for Chemical Genomics(SBCCG) Source Affiliation: Sanford-Burnham Medical Research Institute (SBMRI, San Diego, C...
In DepthDetails PCBioAssay
TargetCannabinoid receptor 1(Homo sapiens (Human))
Burnham Center For Chemical Genomics
Curated by PubChem BioAssay
LigandPNGBDBM76064(2-(3-bromophenyl)-7-methyl-4-(1-naphthalenyl)pyraz...)
Affinity DataIC50:  661nM. Assay description: Data Source: Sanford-Burnham Center for Chemical Genomics Source Affiliation: Sanford-Burnham Medical Research Institute (SBMRI, San Diego) Network...
In DepthDetails PCBioAssay
TargetG-protein coupled receptor 35(Homo sapiens (Human))
Burnham Center For Chemical Genomics
Curated by PubChem BioAssay
LigandPNGBDBM76064(2-(3-bromophenyl)-7-methyl-4-(1-naphthalenyl)pyraz...)
Affinity DataEC50: >3.20E+4nM. Assay description: Data Source: Sanford-Burnham Center for Chemical Genomics Source Affiliation: Sanford-Burnham Medical Research Institute Network: NIH Molecular Libr...
In DepthDetails PCBioAssay
TargetG-protein coupled receptor 35(Homo sapiens (Human))
Burnham Center For Chemical Genomics
Curated by PubChem BioAssay
LigandPNGBDBM76064(2-(3-bromophenyl)-7-methyl-4-(1-naphthalenyl)pyraz...)
Affinity DataIC50:  2.82E+4nM. Assay description: Data Source: Sanford-Burnham Center for Chemical Genomics (SBCCG) Source Affiliation: Sanford-Burnham Medical Research Institute (SBMRI, San Diego, C...
In DepthDetails PCBioAssay