BDBM76121 MLS000578037::N-(2-methoxy-3-dibenzofuranyl)-3-nitrobenzamide::N-(2-methoxydibenzo[b,d]furan-3-yl)-3-nitrobenzamide::N-(2-methoxydibenzofuran-3-yl)-3-nitro-benzamide::N-(2-methoxydibenzofuran-3-yl)-3-nitrobenzamide::SMR000187222::cid_2684591
SMILES COc1cc2c(cc1NC(=O)c1cccc(c1)[N+]([O-])=O)oc1ccccc21
InChI Key InChIKey=HCMLFCXEIXWWRQ-UHFFFAOYSA-N
Data  2 IC50  2 EC50
  Tab Delimited (TSV)   2D SDfile   Computed 3D by Vconf -m prep SDfile
Find this compound or compounds like it in BindingDB:
Activity Spreadsheet -- Enzyme Inhibition Constant Data from BindingDB
Found 4 hits for monomerid = 76121
TargetType-1 angiotensin II receptor(Homo sapiens (Human))
Burnham Center For Chemical Genomics
Curated by PubChem BioAssay
LigandPNGBDBM76121(MLS000578037 | N-(2-methoxy-3-dibenzofuranyl)-3-ni...)
Affinity DataEC50: >1.00E+5nM. Assay description: Data Source: Sanford-Burnham Center for Chemical Genomics (SBCCG) Source Affiliation: Sanford-Burnham Medical Research Institute(SBMRI, San Diego) Ne...
In DepthDetails PCBioAssay
TargetLow molecular weight phosphotyrosine protein phosphatase(Homo sapiens (Human))
Burnham Center For Chemical Genomics
Curated by PubChem BioAssay
LigandPNGBDBM76121(MLS000578037 | N-(2-methoxy-3-dibenzofuranyl)-3-ni...)
Affinity DataIC50: >8.00E+4nM
In DepthDetails PCBioAssay
TargetLow molecular weight phosphotyrosine protein phosphatase(Homo sapiens (Human))
Burnham Center For Chemical Genomics
Curated by PubChem BioAssay
LigandPNGBDBM76121(MLS000578037 | N-(2-methoxy-3-dibenzofuranyl)-3-ni...)
Affinity DataIC50:  1.42E+4nM
In DepthDetails PCBioAssay
TargetApelin receptor(Homo sapiens (Human))
Burnham Center For Chemical Genomics
Curated by PubChem BioAssay
LigandPNGBDBM76121(MLS000578037 | N-(2-methoxy-3-dibenzofuranyl)-3-ni...)
Affinity DataEC50: >1.00E+5nM. Assay description: Data Source: Sanford-Burnham Center for Chemical Genomics (SBCCG) Source Affiliation: Sanford-Burnham Medical Research Institute(SBMRI, San Diego) Ne...
In DepthDetails PCBioAssay