BDBM76149 4-[benzyl(methyl)sulfamoyl]-N-[3-(dimethylamino)propyl]-N-(4-ethoxy-1,3-benzothiazol-2-yl)benzamide;hydrochloride::MLS001239362::N-[3-(dimethylamino)propyl]-N-(4-ethoxy-1,3-benzothiazol-2-yl)-4-[methyl-(phenylmethyl)sulfamoyl]benzamide;hydrochloride::SMR000807820::cid_24892612
SMILES CCOc1cccc2sc(nc12)N(CCCN(C)C)C(=O)c1ccc(cc1)S(=O)(=O)N(C)Cc1ccccc1
InChI Key InChIKey=IWWLCALWBJNSIU-UHFFFAOYSA-N
Data  3 IC50  2 EC50
  Tab Delimited (TSV)   2D SDfile   Computed 3D by Vconf -m prep SDfile
Find this compound or compounds like it in BindingDB:
Activity Spreadsheet -- Enzyme Inhibition Constant Data from BindingDB
Found 5 hits for monomerid = 76149
TargetType-1 angiotensin II receptor(Homo sapiens (Human))
Burnham Center For Chemical Genomics
Curated by PubChem BioAssay
LigandPNGBDBM76149(4-[benzyl(methyl)sulfamoyl]-N-[3-(dimethylamino)pr...)
Affinity DataEC50: >1.00E+5nM. Assay description: Data Source: Sanford-Burnham Center for Chemical Genomics (SBCCG) Source Affiliation: Sanford-Burnham Medical Research Institute(SBMRI, San Diego) Ne...
In DepthDetails PCBioAssay
TargetApelin receptor(Homo sapiens (Human))
Burnham Center For Chemical Genomics
Curated by PubChem BioAssay
LigandPNGBDBM76149(4-[benzyl(methyl)sulfamoyl]-N-[3-(dimethylamino)pr...)
Affinity DataEC50: >1.00E+5nM. Assay description: Data Source: Sanford-Burnham Center for Chemical Genomics (SBCCG) Source Affiliation: Sanford-Burnham Medical Research Institute(SBMRI, San Diego) Ne...
In DepthDetails PCBioAssay
TargetUbiquitin-conjugating enzyme E2 N(Homo sapiens (Human))
Burnham Center For Chemical Genomics
Curated by PubChem BioAssay
LigandPNGBDBM76149(4-[benzyl(methyl)sulfamoyl]-N-[3-(dimethylamino)pr...)
Affinity DataIC50:  8.54E+3nM. Assay description: Data Source: Sanford-Burnham Center for Chemical Genomics (SBCCG) Source Affiliation: Sanford-Burnham Medical Research Institute (SBMRI, San Diego CA...
In DepthDetails PCBioAssay
TargetBcl-2-related protein A1(Mus musculus (Mouse))
Burnham Center For Chemical Genomics
Curated by PubChem BioAssay
LigandPNGBDBM76149(4-[benzyl(methyl)sulfamoyl]-N-[3-(dimethylamino)pr...)
Affinity DataIC50: >2.00E+4nM. Assay description: Data Source: Sanford-Burnham Center for Chemical Genomics (SBCCG) Source Affiliation: Sanford-Burnham Medical Research Institute (SBMRI, San Diego CA...
In DepthDetails PCBioAssay
TargetUbiquitin-conjugating enzyme E2 N(Homo sapiens (Human))
Burnham Center For Chemical Genomics
Curated by PubChem BioAssay
LigandPNGBDBM76149(4-[benzyl(methyl)sulfamoyl]-N-[3-(dimethylamino)pr...)
Affinity DataIC50:  8.12E+3nM. Assay description: Data Source: Sanford-Burnham Center for Chemical Genomics (SBCCG) Source Affiliation: Sanford-Burnham Medical Research Institute (SBMRI, San Diego CA...
In DepthDetails PCBioAssay