BDBM76151 4-[11-[[(2S)-2-[4-[5-(tert-butoxycarbonylamino)pentyl]triazol-1-yl]-3-hydroxy-propanoyl]amino]undecanoyl]piperazine-1-carboxylic acid tert-butyl ester::4-[11-[[(2S)-3-hydroxy-2-[4-[5-[[(2-methylpropan-2-yl)oxy-oxomethyl]amino]pentyl]-1-triazolyl]-1-oxopropyl]amino]-1-oxoundecyl]-1-piperazinecarboxylic acid tert-butyl ester::Boc-KS::MLS002153745::SMR001231171::cid_24983197::tert-butyl 4-[11-[[(2S)-2-[4-[5-[(2-methylpropan-2-yl)oxycarbonylamino]pentyl]-1,2,3-triazol-1-yl]-3-oxidanyl-propanoyl]amino]undecanoyl]piperazine-1-carboxylate::tert-butyl 4-[11-[[(2S)-3-hydroxy-2-[4-[5-[(2-methylpropan-2-yl)oxycarbonylamino]pentyl]triazol-1-yl]propanoyl]amino]undecanoyl]piperazine-1-carboxylate
SMILES CC(C)(C)OC(=O)NCCCCCc1cn(nn1)[C@@H](CO)C(=O)NCCCCCCCCCCC(=O)N1CCN(CC1)C(=O)OC(C)(C)C
InChI Key InChIKey=ZEWFDRRNFOUMJZ-LJAQVGFWSA-N
Data  2 IC50  3 EC50
  Tab Delimited (TSV)   2D SDfile   Computed 3D by Vconf -m prep SDfile
Find this compound or compounds like it in BindingDB:
Activity Spreadsheet -- Enzyme Inhibition Constant Data from BindingDB
Found 5 hits for monomerid = 76151
TargetType-1 angiotensin II receptor(Homo sapiens (Human))
Burnham Center For Chemical Genomics
Curated by PubChem BioAssay
LigandPNGBDBM76151(4-[11-[[(2S)-2-[4-[5-(tert-butoxycarbonylamino)pen...)
Affinity DataEC50: >1.00E+5nM. Assay description: Data Source: Sanford-Burnham Center for Chemical Genomics (SBCCG) Source Affiliation: Sanford-Burnham Medical Research Institute(SBMRI, San Diego) Ne...
In DepthDetails PCBioAssay
TargetApelin receptor(Homo sapiens (Human))
Burnham Center For Chemical Genomics
Curated by PubChem BioAssay
LigandPNGBDBM76151(4-[11-[[(2S)-2-[4-[5-(tert-butoxycarbonylamino)pen...)
Affinity DataEC50: >1.00E+5nM. Assay description: Data Source: Sanford-Burnham Center for Chemical Genomics (SBCCG) Source Affiliation: Sanford-Burnham Medical Research Institute(SBMRI, San Diego) Ne...
In DepthDetails PCBioAssay
TargetTegument protein VP16(Human herpesvirus 1 (strain 17) (HHV-1) (Human her...)
The Scripps Research Institute Molecular Screening Center
Curated by PubChem BioAssay
LigandPNGBDBM76151(4-[11-[[(2S)-2-[4-[5-(tert-butoxycarbonylamino)pen...)
Affinity DataIC50:  1.33E+4nM. Assay description: Source (MLPCN Center Name): The Scripps Research Institute Molecular Screening Center Affiliation: The Scripps Research Institute, TSRI Assay Provide...
In DepthDetails PCBioAssay
TargetTumor necrosis factor receptor superfamily member 10B(Homo sapiens (Human))
Burnham Center For Chemical Genomics
Curated by PubChem BioAssay
LigandPNGBDBM76151(4-[11-[[(2S)-2-[4-[5-(tert-butoxycarbonylamino)pen...)
Affinity DataEC50:  6.87E+3nM
In DepthDetails PCBioAssay
TargetCOUP transcription factor 2(Homo sapiens (Human))
The Scripps Research Institute Molecular Screening Center
Curated by PubChem BioAssay
LigandPNGBDBM76151(4-[11-[[(2S)-2-[4-[5-(tert-butoxycarbonylamino)pen...)
Affinity DataIC50:  3.28E+3nM
In DepthDetails PCBioAssay