BDBM76210 1-[(3,5-dimethyl-1-propan-2-yl-4-pyrazolyl)methyl]-N-[3-(3-fluorophenyl)phenyl]-4-piperidinecarboxamide::1-[(3,5-dimethyl-1-propan-2-yl-pyrazol-4-yl)methyl]-N-[3-(3-fluorophenyl)phenyl]piperidine-4-carboxamide::1-[(3,5-dimethyl-1-propan-2-ylpyrazol-4-yl)methyl]-N-[3-(3-fluorophenyl)phenyl]piperidine-4-carboxamide::MLS001083078::N-[3-(3-fluorophenyl)phenyl]-1-[(1-isopropyl-3,5-dimethyl-pyrazol-4-yl)methyl]isonipecotamide::SMR000658475::cid_24790586
SMILES CC(C)n1nc(C)c(CN2CCC(CC2)C(=O)Nc2cccc(c2)-c2cccc(F)c2)c1C
InChI Key InChIKey=QYVJNOLAQFWVNH-UHFFFAOYSA-N
Data  4 IC50
  Tab Delimited (TSV)   2D SDfile   Computed 3D by Vconf -m prep SDfile
Find this compound or compounds like it in BindingDB:
Activity Spreadsheet -- Enzyme Inhibition Constant Data from BindingDB
Found 4 hits for monomerid = 76210
TargetIntestinal-type alkaline phosphatase(Homo sapiens (Human))
Burnham Center For Chemical Genomics
Curated by PubChem BioAssay
LigandPNGBDBM76210(1-[(3,5-dimethyl-1-propan-2-yl-4-pyrazolyl)methyl]...)
Affinity DataIC50:  1.20E+4nM. Assay description: Data Source: Sanford-Burnham Center for Chemical Genomics (SBCCG) Source Affiliation: Sanford-Burnham Medical Research Institute(SBMRI, San Diego, CA...
In DepthDetails PCBioAssay
TargetIntestinal-type alkaline phosphatase 1(Rattus norvegicus (Rat))
Burnham Center For Chemical Genomics
Curated by PubChem BioAssay
LigandPNGBDBM76210(1-[(3,5-dimethyl-1-propan-2-yl-4-pyrazolyl)methyl]...)
Affinity DataIC50:  7.53E+3nM. Assay description: Data Source: Sanford-Burnham Center for Chemical Genomics (SBCCG) Source Affiliation: Sanford-Burnham Medical Research Institute (SBMRI, San Diego, C...
In DepthDetails PCBioAssay
TargetAlkaline phosphatase, tissue-nonspecific isozyme(Homo sapiens (Human))
Burnham Center For Chemical Genomics
Curated by PubChem BioAssay
LigandPNGBDBM76210(1-[(3,5-dimethyl-1-propan-2-yl-4-pyrazolyl)methyl]...)
Affinity DataIC50:  5.30E+4nM. Assay description: Data Source: Sanford-Burnham Center for Chemical Genomics (SBCCG) Source Affiliation: Sanford-Burnham Medical Research Institute (SBMRI, San Diego, C...
In DepthDetails PCBioAssay
TargetAlkaline phosphatase, germ cell type(Homo sapiens (Human))
Burnham Center For Chemical Genomics
Curated by PubChem BioAssay
LigandPNGBDBM76210(1-[(3,5-dimethyl-1-propan-2-yl-4-pyrazolyl)methyl]...)
Affinity DataIC50:  5.66E+4nM. Assay description: Data Source: Sanford-Burnham Center for Chemical Genomics (SBCCG) Source Affiliation: Sanford-Burnham Medical Research Institute (SBMRI, San Diego, C...
In DepthDetails PCBioAssay