BDBM76216 2-[(2-keto-3H-1,3-benzoxazol-6-yl)sulfonyl-methyl-amino]-N-(3-methoxyphenyl)acetamide::MLS001096113::N-(3-methoxyphenyl)-2-[methyl-[(2-oxidanylidene-3H-1,3-benzoxazol-6-yl)sulfonyl]amino]ethanamide::N-(3-methoxyphenyl)-2-[methyl-[(2-oxo-3H-1,3-benzoxazol-6-yl)sulfonyl]amino]acetamide::SMR000631031::cid_20949396
SMILES COc1cccc(NC(=O)CN(C)S(=O)(=O)c2ccc3[nH]c(=O)oc3c2)c1
InChI Key InChIKey=BXRHNJQNDAHSRT-UHFFFAOYSA-N
Data  4 IC50
  Tab Delimited (TSV)   2D SDfile   Computed 3D by Vconf -m prep SDfile
Find this compound or compounds like it in BindingDB:
Activity Spreadsheet -- Enzyme Inhibition Constant Data from BindingDB
Found 4 hits for monomerid = 76216
TargetIntestinal-type alkaline phosphatase(Homo sapiens (Human))
Burnham Center For Chemical Genomics
Curated by PubChem BioAssay
LigandPNGBDBM76216(2-[(2-keto-3H-1,3-benzoxazol-6-yl)sulfonyl-methyl-...)
Affinity DataIC50: >1.00E+5nM. Assay description: Data Source: Sanford-Burnham Center for Chemical Genomics (SBCCG) Source Affiliation: Sanford-Burnham Medical Research Institute(SBMRI, San Diego, CA...
In DepthDetails PCBioAssay
TargetIntestinal-type alkaline phosphatase 1(Rattus norvegicus (Rat))
Burnham Center For Chemical Genomics
Curated by PubChem BioAssay
LigandPNGBDBM76216(2-[(2-keto-3H-1,3-benzoxazol-6-yl)sulfonyl-methyl-...)
Affinity DataIC50:  4.03E+3nM. Assay description: Data Source: Sanford-Burnham Center for Chemical Genomics (SBCCG) Source Affiliation: Sanford-Burnham Medical Research Institute (SBMRI, San Diego, C...
In DepthDetails PCBioAssay
TargetAlkaline phosphatase, tissue-nonspecific isozyme(Homo sapiens (Human))
Burnham Center For Chemical Genomics
Curated by PubChem BioAssay
LigandPNGBDBM76216(2-[(2-keto-3H-1,3-benzoxazol-6-yl)sulfonyl-methyl-...)
Affinity DataIC50: >1.00E+5nM. Assay description: Data Source: Sanford-Burnham Center for Chemical Genomics (SBCCG) Source Affiliation: Sanford-Burnham Medical Research Institute (SBMRI, San Diego, C...
In DepthDetails PCBioAssay
TargetAlkaline phosphatase, germ cell type(Homo sapiens (Human))
Burnham Center For Chemical Genomics
Curated by PubChem BioAssay
LigandPNGBDBM76216(2-[(2-keto-3H-1,3-benzoxazol-6-yl)sulfonyl-methyl-...)
Affinity DataIC50: >1.00E+5nM. Assay description: Data Source: Sanford-Burnham Center for Chemical Genomics (SBCCG) Source Affiliation: Sanford-Burnham Medical Research Institute (SBMRI, San Diego, C...
In DepthDetails PCBioAssay