BDBM76264 (6E)-6-[[(2,6-dimethyl-5-prop-2-enyl-4-pyrimidinyl)hydrazo]methylidene]-1-cyclohexa-2,4-dienone::(6E)-6-[[2-(2,6-dimethyl-5-prop-2-enyl-pyrimidin-4-yl)hydrazinyl]methylidene]cyclohexa-2,4-dien-1-one::(6E)-6-[[2-(2,6-dimethyl-5-prop-2-enylpyrimidin-4-yl)hydrazinyl]methylidene]cyclohexa-2,4-dien-1-one::(6E)-6-[[N'-(5-allyl-2,6-dimethyl-pyrimidin-4-yl)hydrazino]methylene]cyclohexa-2,4-dien-1-one::2-[(5-Allyl-2,6-dimethyl-pyrimidin-4-yl)-hydrazonomethyl]-phenol::MLS000550866::SMR000144994::cid_5851399
SMILES Cc1nc(C)c(CC=C)c(N=NCc2ccccc2O)n1
InChI Key InChIKey=XMIZGHFUXLWANO-UHFFFAOYSA-N
Data  2 IC50
  Tab Delimited (TSV)   2D SDfile   Computed 3D by Vconf -m prep SDfile
Find this compound or compounds like it in BindingDB:
Activity Spreadsheet -- Enzyme Inhibition Constant Data from BindingDB
Found 2 hits for monomerid = 76264
TargetNACHT, LRR and PYD domains-containing protein 3(Homo sapiens (Human))
Burnham Center For Chemical Genomics
Curated by PubChem BioAssay
LigandPNGBDBM76264((6E)-6-[[(2,6-dimethyl-5-prop-2-enyl-4-pyrimidinyl...)
Affinity DataIC50:  9.37E+3nM. Assay description: Data Source: Sanford-Burnham Center for Chemical Genomics (SBCCG) Source Affiliation: Sanford-Burnham Medical Research Institute (SBMRI, San Diego, C...
Ligand InfoPC cidPC sid
In DepthDetails PCBioAssay
TargetNACHT, LRR and PYD domains-containing protein 3(Homo sapiens (Human))
Burnham Center For Chemical Genomics
Curated by PubChem BioAssay
LigandPNGBDBM76264((6E)-6-[[(2,6-dimethyl-5-prop-2-enyl-4-pyrimidinyl...)
Affinity DataIC50:  4.55E+4nM. Assay description: Data Source: Sanford-Burnham Center for Chemical Genomics (SBCCG) Source Affiliation: Sanford-Burnham Medical Research Institute (SBMRI, San Diego, C...
Ligand InfoPC cidPC sid
In DepthDetails PCBioAssay