BDBM76269 5-(phenoxymethyl)-1-phenyl-1,2,3,4-tetrazole::5-(phenoxymethyl)-1-phenyl-1H-tetrazole::5-(phenoxymethyl)-1-phenyl-tetrazole::5-(phenoxymethyl)-1-phenyltetrazole::MLS000582966::SMR000200995::cid_2969379
SMILES C(Oc1ccccc1)c1nnnn1-c1ccccc1
InChI Key InChIKey=KRYHCNMBYSZHGY-UHFFFAOYSA-N
Data  1 IC50
  Tab Delimited (TSV)   2D SDfile   Computed 3D by Vconf -m prep SDfile
Find this compound or compounds like it in BindingDB:
Activity Spreadsheet -- Enzyme Inhibition Constant Data from BindingDB
Found 1 hit for monomerid = 76269
TargetNACHT, LRR and PYD domains-containing protein 3(Homo sapiens (Human))
Burnham Center For Chemical Genomics
Curated by PubChem BioAssay
LigandPNGBDBM76269(5-(phenoxymethyl)-1-phenyl-1,2,3,4-tetrazole | 5-(...)
Affinity DataIC50:  6.00E+3nM. Assay description: Data Source: Sanford-Burnham Center for Chemical Genomics (SBCCG) Source Affiliation: Sanford-Burnham Medical Research Institute (SBMRI, San Diego, C...
In DepthDetails PCBioAssay