BDBM76280 MLS001001805::N-(4-methoxyphenyl)-3-phenyl-2-propynamide::N-(4-methoxyphenyl)-3-phenyl-prop-2-ynamide::N-(4-methoxyphenyl)-3-phenyl-propiolamide::N-(4-methoxyphenyl)-3-phenylprop-2-ynamide::SMR000499272::cid_6470129
SMILES COc1ccc(NC(=O)C#Cc2ccccc2)cc1
InChI Key InChIKey=LDVRUGKDDZWJJO-UHFFFAOYSA-N
Data  2 IC50
  Tab Delimited (TSV)   2D SDfile   Computed 3D by Vconf -m prep SDfile
Find this compound or compounds like it in BindingDB:
Activity Spreadsheet -- Enzyme Inhibition Constant Data from BindingDB
Found 2 hits for monomerid = 76280
TargetNACHT, LRR and PYD domains-containing protein 3(Homo sapiens (Human))
Burnham Center For Chemical Genomics
Curated by PubChem BioAssay
LigandPNGBDBM76280(MLS001001805 | N-(4-methoxyphenyl)-3-phenyl-2-prop...)
Affinity DataIC50:  1.44E+3nM. Assay description: Data Source: Sanford-Burnham Center for Chemical Genomics (SBCCG) Source Affiliation: Sanford-Burnham Medical Research Institute (SBMRI, San Diego, C...
In DepthDetails PCBioAssay
TargetNACHT, LRR and PYD domains-containing protein 3(Homo sapiens (Human))
Burnham Center For Chemical Genomics
Curated by PubChem BioAssay
LigandPNGBDBM76280(MLS001001805 | N-(4-methoxyphenyl)-3-phenyl-2-prop...)
Affinity DataIC50:  8.01E+3nM. Assay description: Data Source: Sanford-Burnham Center for Chemical Genomics (SBCCG) Source Affiliation: Sanford-Burnham Medical Research Institute (SBMRI, San Diego, C...
In DepthDetails PCBioAssay