BDBM76326 MLS000390388::N-(2,4-dichlorobenzyl)-4-ethyl-benzamide::N-[(2,4-dichlorophenyl)methyl]-4-ethyl-benzamide::N-[(2,4-dichlorophenyl)methyl]-4-ethylbenzamide::SMR000255355::cid_2707305
SMILES CCc1ccc(cc1)C(=O)NCc1ccc(Cl)cc1Cl
InChI Key InChIKey=YMJBBUOVMOJNDR-UHFFFAOYSA-N
Data  2 IC50
  Tab Delimited (TSV)   2D SDfile   Computed 3D by Vconf -m prep SDfile
Find this compound or compounds like it in BindingDB:
Activity Spreadsheet -- Enzyme Inhibition Constant Data from BindingDB
Found 2 hits for monomerid = 76326
TargetCaspase-1(Homo sapiens (Human))
Burnham Center For Chemical Genomics
Curated by PubChem BioAssay
LigandPNGBDBM76326(MLS000390388 | N-(2,4-dichlorobenzyl)-4-ethyl-benz...)
Affinity DataIC50:  6.10E+4nM. Assay description: Data Source: Sanford-Burnham Center for Chemical Genomics (SBCCG) Source Affiliation: Sanford-Burnham Medical Research Institute (SBMRI, San Diego, C...
In DepthDetails PCBioAssay
TargetNACHT, LRR and PYD domains-containing protein 1(Homo sapiens (Human))
Burnham Center For Chemical Genomics
Curated by PubChem BioAssay
LigandPNGBDBM76326(MLS000390388 | N-(2,4-dichlorobenzyl)-4-ethyl-benz...)
Affinity DataIC50:  3.39E+4nM. Assay description: Data Source: Sanford-Burnham Center for Chemical Genomics (SBCCG) Source Affiliation: Sanford-Burnham Medical Research Institute (SBMRI, San Diego, C...
In DepthDetails PCBioAssay