BDBM7642 Imidazo[1,2-a]pyridine deriv. 2::N-(4-{2-methylimidazo[1,2-a]pyridin-3-yl}pyrimidin-2-yl)acetamide
SMILES CC(=O)Nc1nccc(n1)-c1c(C)nc2ccccn12
InChI Key InChIKey=ZCRPPLDDHBLUES-UHFFFAOYSA-N
Data  3 IC50
PDB links: 1 PDB ID matches this monomer.
  Tab Delimited (TSV)   2D SDfile   Computed 3D by Vconf -m prep SDfile
Find this compound or compounds like it in BindingDB:
Activity Spreadsheet -- Enzyme Inhibition Constant Data from BindingDB
Found 3 hits for monomerid = 7642
TargetCyclin-dependent kinase 2/G1/S-specific cyclin-E1(Homo sapiens (Human))
Astrazeneca
LigandPNGBDBM7642(Imidazo[1,2-a]pyridine deriv. 2 | N-(4-{2-methylim...)
Affinity DataIC50:  2.90E+3nMpH: 7.0 T: 2°C. Assay description: The kinase activity was assayed using an in vitro scintillation proximity assay (SPA) for measuring incorporation of [gamma-33P] ATP into GST-Rb.
TargetCyclin-dependent kinase 2/G1/S-specific cyclin-E1(Homo sapiens (Human))
Astrazeneca
LigandPNGBDBM7642(Imidazo[1,2-a]pyridine deriv. 2 | N-(4-{2-methylim...)
Affinity DataIC50:  2.88E+3nM. Assay description: Inhibition of CDK2/Cyclin E (unknown origin)
TargetCyclin-dependent kinase 4/G1/S-specific cyclin-D1(Homo sapiens (Human))
Astrazeneca
LigandPNGBDBM7642(Imidazo[1,2-a]pyridine deriv. 2 | N-(4-{2-methylim...)
Affinity DataIC50:  8.90E+3nMpH: 7.0 T: 2°C. Assay description: The kinase activity was assayed using an in vitro scintillation proximity assay (SPA) for measuring incorporation of [gamma-33P] ATP into GST-Rb.
In DepthDetails ArticlePubMed