BDBM76503 3-chloranyl-N-(5-methyl-1,3-thiazol-2-yl)-1-benzothiophene-2-carboxamide::3-chloro-N-(5-methyl-1,3-thiazol-2-yl)-1-benzothiophene-2-carboxamide::3-chloro-N-(5-methyl-2-thiazolyl)-1-benzothiophene-2-carboxamide::3-chloro-N-(5-methylthiazol-2-yl)benzothiophene-2-carboxamide::MLS000334487::SMR000249245::cid_2523343
SMILES Cc1cnc(NC(=O)c2sc3ccccc3c2Cl)s1
InChI Key InChIKey=PETQNGKAFAHVEX-UHFFFAOYSA-N
Data  7 IC50  2 EC50
  Tab Delimited (TSV)   2D SDfile   Computed 3D by Vconf -m prep SDfile
Find this compound or compounds like it in BindingDB:
Activity Spreadsheet -- Enzyme Inhibition Constant Data from BindingDB
Found 9 hits for monomerid = 76503
TargetSentrin-specific protease 8(Homo sapiens (Human))
Burnham Center For Chemical Genomics
Curated by PubChem BioAssay
LigandPNGBDBM76503(3-chloranyl-N-(5-methyl-1,3-thiazol-2-yl)-1-benzot...)
Affinity DataIC50:  2.56E+3nM. Assay description: Data Source: Sanford-Burnham Center for Chemical Genomics (SBCCG) Source Affiliation: Sanford-Burnham Medical Research Institute (SBMRI, San Diego, C...
In DepthDetails PCBioAssay
TargetSentrin-specific protease 6(Homo sapiens (Human))
Burnham Center For Chemical Genomics
Curated by PubChem BioAssay
LigandPNGBDBM76503(3-chloranyl-N-(5-methyl-1,3-thiazol-2-yl)-1-benzot...)
Affinity DataIC50: >1.00E+5nM. Assay description: Data Source: Sanford-Burnham Center for Chemical Genomics (SBCCG) Source Affiliation: Sanford-Burnham Medical Research Institute (SBMRI, San Diego, C...
In DepthDetails PCBioAssay
TargetCaspase-3(Homo sapiens (Human))
Burnham Center For Chemical Genomics
Curated by PubChem BioAssay
LigandPNGBDBM76503(3-chloranyl-N-(5-methyl-1,3-thiazol-2-yl)-1-benzot...)
Affinity DataIC50:  6.67E+3nM. Assay description: Data Source: Sanford-Burnham Center for Chemical Genomics (SBCCG) Source Affiliation: Sanford-Burnham Medical Research Institute (SBMRI, San Diego, C...
In DepthDetails PCBioAssay
TargetNuclear receptor subfamily 0 group B member 1(Homo sapiens (Human))
The Scripps Research Institute Molecular Screening Center
Curated by PubChem BioAssay
LigandPNGBDBM76503(3-chloranyl-N-(5-methyl-1,3-thiazol-2-yl)-1-benzot...)
Affinity DataIC50: >6.75E+4nM
In DepthDetails PCBioAssay
TargetNuclear hormone receptor family member daf-12(Caenorhabditis elegans)
The Scripps Research Institute Molecular Screening Center
Curated by PubChem BioAssay
LigandPNGBDBM76503(3-chloranyl-N-(5-methyl-1,3-thiazol-2-yl)-1-benzot...)
Affinity DataIC50:  6.75E+4nM. Assay description: Source (MLPCN Center Name): The Scripps Research Institute Molecular Screening Center Affiliation: UT Southwestern Assay Provider: David Mangelsdorf,...
In DepthDetails PCBioAssay
TargetOxysterols receptor LXR-beta(Homo sapiens (Human))
The Scripps Research Institute Molecular Screening Center
Curated by PubChem BioAssay
LigandPNGBDBM76503(3-chloranyl-N-(5-methyl-1,3-thiazol-2-yl)-1-benzot...)
Affinity DataEC50:  6.75E+4nM. Assay description: Source (MLPCN Center Name): The Scripps Research Institute Molecular Screening Center Affiliation: UT Southwestern Assay Provider: David Mangelsdorf,...
In DepthDetails PCBioAssay
TargetOxysterols receptor LXR-beta(Homo sapiens (Human))
The Scripps Research Institute Molecular Screening Center
Curated by PubChem BioAssay
LigandPNGBDBM76503(3-chloranyl-N-(5-methyl-1,3-thiazol-2-yl)-1-benzot...)
Affinity DataIC50:  6.75E+4nM. Assay description: Source (MLPCN Center Name): The Scripps Research Institute Molecular Screening Center Affiliation: UT Southwestern Assay Provider: David Mangelsdorf,...
In DepthDetails PCBioAssay
TargetNuclear hormone receptor family member daf-12(Caenorhabditis elegans)
The Scripps Research Institute Molecular Screening Center
Curated by PubChem BioAssay
LigandPNGBDBM76503(3-chloranyl-N-(5-methyl-1,3-thiazol-2-yl)-1-benzot...)
Affinity DataEC50:  6.75E+4nM. Assay description: Source (MLPCN Center Name): The Scripps Research Institute Molecular Screening Center (SRIMSC) Affiliation: The Scripps Research Institute, TSRI Assa...
In DepthDetails PCBioAssay
TargetSteroidogenic factor 1(Homo sapiens (Human))
The Scripps Research Institute Molecular Screening Center
Curated by PubChem BioAssay
LigandPNGBDBM76503(3-chloranyl-N-(5-methyl-1,3-thiazol-2-yl)-1-benzot...)
Affinity DataIC50: >6.75E+4nM
In DepthDetails PCBioAssay