BDBM76648 (4-Methyl-pyridin-2-yl)-(4-phenyl-thiazol-2-yl)-amine::(4-methyl-2-pyridyl)-(4-phenylthiazol-2-yl)amine;hydrobromide::MLS001209393::N-(4-methyl-2-pyridinyl)-4-phenyl-2-thiazolamine;hydrobromide::N-(4-methylpyridin-2-yl)-4-phenyl-1,3-thiazol-2-amine;hydrobromide::SMR000516487::cid_2877172
SMILES Cc1ccnc(Nc2nc(cs2)-c2ccccc2)c1
InChI Key InChIKey=YIJMAUFKBCAMPF-UHFFFAOYSA-N
Data  4 IC50
  Tab Delimited (TSV)   2D SDfile   Computed 3D by Vconf -m prep SDfile
Find this compound or compounds like it in BindingDB:
Activity Spreadsheet -- Enzyme Inhibition Constant Data from BindingDB
Found 4 hits for monomerid = 76648
TargetCaspase-3(Homo sapiens (Human))
Burnham Center For Chemical Genomics
Curated by PubChem BioAssay
LigandPNGBDBM76648((4-Methyl-pyridin-2-yl)-(4-phenyl-thiazol-2-yl)-am...)
Affinity DataIC50:  1.31E+4nM. Assay description: Data Source: Sanford-Burnham Center for Chemical Genomics (SBCCG) Source Affiliation: Sanford-Burnham Medical Research Institute (SBMRI, San Diego, C...
In DepthDetails PCBioAssay
TargetSentrin-specific protease 6(Homo sapiens (Human))
Burnham Center For Chemical Genomics
Curated by PubChem BioAssay
LigandPNGBDBM76648((4-Methyl-pyridin-2-yl)-(4-phenyl-thiazol-2-yl)-am...)
Affinity DataIC50:  7.16E+3nM. Assay description: Data Source: Sanford-Burnham Center for Chemical Genomics (SBCCG) Source Affiliation: Sanford-Burnham Medical Research Institute (SBMRI, San Diego, C...
In DepthDetails PCBioAssay
TargetSentrin-specific protease 8(Homo sapiens (Human))
Burnham Center For Chemical Genomics
Curated by PubChem BioAssay
LigandPNGBDBM76648((4-Methyl-pyridin-2-yl)-(4-phenyl-thiazol-2-yl)-am...)
Affinity DataIC50:  824nM. Assay description: Data Source: Sanford-Burnham Center for Chemical Genomics (SBCCG) Source Affiliation: Sanford-Burnham Medical Research Institute (SBMRI, San Diego, C...
In DepthDetails PCBioAssay
TargetSentrin-specific protease 8(Homo sapiens (Human))
Burnham Center For Chemical Genomics
Curated by PubChem BioAssay
LigandPNGBDBM76648((4-Methyl-pyridin-2-yl)-(4-phenyl-thiazol-2-yl)-am...)
Affinity DataIC50:  3.93E+3nM. Assay description: Data Source: Sanford-Burnham Center for Chemical Genomics (SBCCG) Source Affiliation: Sanford-Burnham Medical Research Institute (SBMRI, San Diego, C...
In DepthDetails PCBioAssay