BDBM77061 MLS000118728::N-(4-fluorophenyl)-2-[[4-(4-fluorophenyl)-5-[(1-methyl-2-pyrrolyl)methyl]-1,2,4-triazol-3-yl]thio]acetamide::N-(4-fluorophenyl)-2-[[4-(4-fluorophenyl)-5-[(1-methylpyrrol-2-yl)methyl]-1,2,4-triazol-3-yl]sulfanyl]acetamide::N-(4-fluorophenyl)-2-[[4-(4-fluorophenyl)-5-[(1-methylpyrrol-2-yl)methyl]-1,2,4-triazol-3-yl]sulfanyl]ethanamide::N-(4-fluorophenyl)-2-[[4-(4-fluorophenyl)-5-[(1-methylpyrrol-2-yl)methyl]-1,2,4-triazol-3-yl]thio]acetamide::SMR000095668::cid_5309713
SMILES Cn1cccc1Cc1nnc(SCC(=O)Nc2ccc(F)cc2)n1-c1ccc(F)cc1
InChI Key InChIKey=CXAHZPCPWMVVSS-UHFFFAOYSA-N
Data  1 EC50
  Tab Delimited (TSV)   2D SDfile   Computed 3D by Vconf -m prep SDfile
Find this compound or compounds like it in BindingDB:
Activity Spreadsheet -- Enzyme Inhibition Constant Data from BindingDB
Found 1 hit for monomerid = 77061
TargetVoltage-dependent T-type calcium channel subunit alpha-1H(Homo sapiens (Human))
Vanderbilt Screening Center For Gpcrs, Ion Channels And Transporters
Curated by PubChem BioAssay
LigandPNGBDBM77061(MLS000118728 | N-(4-fluorophenyl)-2-[[4-(4-fluorop...)
Affinity DataEC50:  2.17E+3nM. Assay description: Assay Provider: Xinmin Xie Assay Provider Affiliation: Bioscience Division, SRI International, Menlo Park, CA Grant Title: HTS Assay for Cav3 T-Type ...
In DepthDetails PCBioAssay