BDBM77087 2-[(1-ethyl-2-benzimidazolyl)methylthio]-1,3-benzothiazole::2-[(1-ethylbenzimidazol-2-yl)methylsulfanyl]-1,3-benzothiazole::2-[(1-ethylbenzimidazol-2-yl)methylthio]-1,3-benzothiazole::MLS000110734::SMR000106663::cid_594518
SMILES CCn1c(CSc2nc3ccccc3s2)nc2ccccc12
InChI Key InChIKey=FSNNDSGFFABAIQ-UHFFFAOYSA-N
Data  1 EC50
  Tab Delimited (TSV)   2D SDfile   Computed 3D by Vconf -m prep SDfile
Find this compound or compounds like it in BindingDB:
Activity Spreadsheet -- Enzyme Inhibition Constant Data from BindingDB
Found 1 hit for monomerid = 77087
TargetVoltage-dependent T-type calcium channel subunit alpha-1H(Homo sapiens (Human))
Vanderbilt Screening Center For Gpcrs, Ion Channels And Transporters
Curated by PubChem BioAssay
LigandPNGBDBM77087(2-[(1-ethyl-2-benzimidazolyl)methylthio]-1,3-benzo...)
Affinity DataEC50:  5.73E+3nM. Assay description: Assay Provider: Xinmin Xie Assay Provider Affiliation: Bioscience Division, SRI International, Menlo Park, CA Grant Title: HTS Assay for Cav3 T-Type ...
In DepthDetails PCBioAssay