BDBM77103 1-Benzhydryl-4-(1-tert-butyl-1H-tetrazol-5-ylmethyl)-piperazine::1-[(1-tert-butyl-1,2,3,4-tetrazol-5-yl)methyl]-4-(diphenylmethyl)piperazine::1-[(1-tert-butyl-5-tetrazolyl)methyl]-4-(diphenylmethyl)piperazine::1-benzhydryl-4-[(1-tert-butyltetrazol-5-yl)methyl]piperazine::MLS000121503::SMR000118934::cid_1443785
SMILES CC(C)(C)n1nnnc1CN1CCN(CC1)C(c1ccccc1)c1ccccc1
InChI Key InChIKey=JRPWIKCYHWOKAZ-UHFFFAOYSA-N
Data  2 EC50
  Tab Delimited (TSV)   2D SDfile   Computed 3D by Vconf -m prep SDfile
Find this compound or compounds like it in BindingDB:
Activity Spreadsheet -- Enzyme Inhibition Constant Data from BindingDB
Found 2 hits for monomerid = 77103
TargetVoltage-dependent T-type calcium channel subunit alpha-1H(Homo sapiens (Human))
Vanderbilt Screening Center For Gpcrs, Ion Channels And Transporters
Curated by PubChem BioAssay
LigandPNGBDBM77103(1-Benzhydryl-4-(1-tert-butyl-1H-tetrazol-5-ylmethy...)
Affinity DataEC50:  6.42E+3nM. Assay description: Assay Provider: Xinmin Xie Assay Provider Affiliation: Bioscience Division, SRI International, Menlo Park, CA Grant Title: HTS Assay for Cav3 T-Type ...
In DepthDetails PCBioAssay
TargetVoltage-dependent T-type calcium channel subunit alpha-1H(Homo sapiens (Human))
Vanderbilt Screening Center For Gpcrs, Ion Channels And Transporters
Curated by PubChem BioAssay
LigandPNGBDBM77103(1-Benzhydryl-4-(1-tert-butyl-1H-tetrazol-5-ylmethy...)
Affinity DataEC50:  7.64E+3nM. Assay description: Assay Provider: Xinmin Xie Assay Provider Affiliation: Bioscience Division, SRI International, Menlo Park, CA Grant Title: HTS Assay for Cav3 T-Type ...
In DepthDetails PCBioAssay