BDBM77454 (E)-N-(2-methylphenyl)-2,3-diphenyl-2-propenamide::(E)-N-(2-methylphenyl)-2,3-diphenyl-prop-2-enamide::(E)-N-(2-methylphenyl)-2,3-diphenylprop-2-enamide::(E)-N-(o-tolyl)-2,3-diphenyl-acrylamide::MLS000573403::N-(2-methylphenyl)-2,3-diphenylacrylamide::SMR000194905::cid_5661263
SMILES Cc1ccccc1NC(=O)C(=C\c1ccccc1)\c1ccccc1
InChI Key InChIKey=YQPRQHWSJCZQCF-CAPFRKAQSA-N
Data  2 IC50  1 EC50
  Tab Delimited (TSV)   2D SDfile   Computed 3D by Vconf -m prep SDfile
Find this compound or compounds like it in BindingDB:
Activity Spreadsheet -- Enzyme Inhibition Constant Data from BindingDB
Found 3 hits for monomerid = 77454
TargetVoltage-dependent T-type calcium channel subunit alpha-1H(Homo sapiens (Human))
Vanderbilt Screening Center For Gpcrs, Ion Channels And Transporters
Curated by PubChem BioAssay
LigandPNGBDBM77454((E)-N-(2-methylphenyl)-2,3-diphenyl-2-propenamide ...)
Affinity DataEC50:  9.09E+3nM. Assay description: Assay Provider: Xinmin Xie Assay Provider Affiliation: Bioscience Division, SRI International, Menlo Park, CA Grant Title: HTS Assay for Cav3 T-Type ...
In DepthDetails PCBioAssay
TargetPhospholipase A2(Homo sapiens (Human))
Burnham Center For Chemical Genomics
Curated by PubChem BioAssay
LigandPNGBDBM77454((E)-N-(2-methylphenyl)-2,3-diphenyl-2-propenamide ...)
Affinity DataIC50:  9.58E+3nM. Assay description: Data Source: Sanford-Burnham Center for Chemical Genomics (SBCCG) Source Affiliation: Sanford-Burnham Medical Research Institute (SBMRI, San Diego, C...
In DepthDetails PCBioAssay
TargetCysteine protease ATG4B(Homo sapiens (Human))
Burnham Center For Chemical Genomics
Curated by PubChem BioAssay
LigandPNGBDBM77454((E)-N-(2-methylphenyl)-2,3-diphenyl-2-propenamide ...)
Affinity DataIC50:  1.08E+4nM. Assay description: Data Source: Sanford-Burnham Center for Chemical Genomics (SBCCG) Source Affiliation: Sanford-Burnham Medical Research Institute (SBMRI, San Diego, C...
In DepthDetails PCBioAssay