BDBM77565 MLS000767606::N-(1-pyridin-2-ylethylideneamino)-[1,2,4]triazolo[4,3-b]pyridazin-6-amine::N-[1-(2-pyridinyl)ethylideneamino]-[1,2,4]triazolo[4,3-b]pyridazin-6-amine::N-[1-Pyridin-2-yl-eth-(E)-ylidene]-N'-[1,2,4]triazolo[4,3-b]pyridazin-6-yl-hydrazine::SMR000429936::[1-(2-pyridyl)ethylideneamino]-([1,2,4]triazolo[4,3-b]pyridazin-6-yl)amine::cid_3810523
SMILES CC(N=Nc1ccc2nncn2n1)c1ccccn1
InChI Key InChIKey=KBXWUOOMASLBQO-UHFFFAOYSA-N
Data  1 IC50
  Tab Delimited (TSV)   2D SDfile   Computed 3D by Vconf -m prep SDfile
Find this compound or compounds like it in BindingDB:
Activity Spreadsheet -- Enzyme Inhibition Constant Data from BindingDB
Found 1 hit for monomerid = 77565
TargetRecBCD enzyme subunit RecD(Escherichia coli str. K-12 substr. MG1655)
The Scripps Research Institute Molecular Screening Center
Curated by PubChem BioAssay
LigandPNGBDBM77565(MLS000767606 | N-(1-pyridin-2-ylethylideneamino)-[...)
Affinity DataIC50:  5.71E+4nM. Assay description: Source (MLPCN Center Name): The Scripps Research Institute Molecular Screening Center (SRIMSC) Affiliation: The Scripps Research Institute, TSRI Assa...
Ligand InfoPC cidPC sid
In DepthDetails PCBioAssay