BDBM77586 2-(1H-benzimidazol-2-ylsulfanyl)-N-(4-morpholin-4-ylphenyl)acetamide::2-(1H-benzimidazol-2-ylsulfanyl)-N-(4-morpholin-4-ylphenyl)ethanamide::2-(1H-benzimidazol-2-ylthio)-N-(4-morpholinophenyl)acetamide::2-(1H-benzimidazol-2-ylthio)-N-[4-(4-morpholinyl)phenyl]acetamide::MLS001162558::SMR000670376::cid_2347323
SMILES O=C(CSc1nc2ccccc2[nH]1)Nc1ccc(cc1)N1CCOCC1
InChI Key InChIKey=UFSYJMYIXPUELO-UHFFFAOYSA-N
Data  1 IC50
  Tab Delimited (TSV)   2D SDfile   Computed 3D by Vconf -m prep SDfile
Find this compound or compounds like it in BindingDB:
Activity Spreadsheet -- Enzyme Inhibition Constant Data from BindingDB
Found 1 hit for monomerid = 77586
TargetRecBCD enzyme subunit RecD(Escherichia coli str. K-12 substr. MG1655)
The Scripps Research Institute Molecular Screening Center
Curated by PubChem BioAssay
LigandPNGBDBM77586(2-(1H-benzimidazol-2-ylsulfanyl)-N-(4-morpholin-4-...)
Affinity DataIC50: >1.18E+5nM. Assay description: Source (MLPCN Center Name): The Scripps Research Institute Molecular Screening Center (SRIMSC) Affiliation: The Scripps Research Institute, TSRI Assa...
In DepthDetails PCBioAssay