BDBM77608 2-(2-amino-6-methylsulfanylpurin-9-yl)-N-(3,4-dimethylphenyl)acetamide::2-(2-azanyl-6-methylsulfanyl-purin-9-yl)-N-(3,4-dimethylphenyl)ethanamide::2-[2-amino-6-(methylthio)-9-purinyl]-N-(3,4-dimethylphenyl)acetamide::2-[2-amino-6-(methylthio)purin-9-yl]-N-(3,4-dimethylphenyl)acetamide::MLS002477166::SMR001399089::cid_44246600
SMILES CSc1nc(N)nc2n(CC(=O)Nc3ccc(C)c(C)c3)cnc12
InChI Key InChIKey=ZIZGTOKJEPSLSW-UHFFFAOYSA-N
Data  1 IC50
  Tab Delimited (TSV)   2D SDfile   Computed 3D by Vconf -m prep SDfile
Find this compound or compounds like it in BindingDB:
Activity Spreadsheet -- Enzyme Inhibition Constant Data from BindingDB
Found 1 hit for monomerid = 77608
TargetRecBCD enzyme subunit RecD(Escherichia coli str. K-12 substr. MG1655)
The Scripps Research Institute Molecular Screening Center
Curated by PubChem BioAssay
LigandPNGBDBM77608(2-(2-amino-6-methylsulfanylpurin-9-yl)-N-(3,4-dime...)
Affinity DataIC50: >1.18E+5nM. Assay description: Source (MLPCN Center Name): The Scripps Research Institute Molecular Screening Center (SRIMSC) Affiliation: The Scripps Research Institute, TSRI Assa...
Ligand InfoPC cidPC sid
In DepthDetails PCBioAssay