BDBM77649 3-[(2-hydroxy-3-methoxy-benzyl)amino]-2-(m-tolyl)quinazolin-4-one::3-[(2-hydroxy-3-methoxybenzyl)amino]-2-(3-methylphenyl)quinazolin-4(3H)-one::3-[(2-hydroxy-3-methoxyphenyl)methylamino]-2-(3-methylphenyl)-4-quinazolinone::3-[(2-hydroxy-3-methoxyphenyl)methylamino]-2-(3-methylphenyl)quinazolin-4-one::3-[(3-methoxy-2-oxidanyl-phenyl)methylamino]-2-(3-methylphenyl)quinazolin-4-one::MLS000089767::SMR000024385::cid_3245030
SMILES COc1cccc(CNn2c(nc3ccccc3c2=O)-c2cccc(C)c2)c1O
InChI Key InChIKey=QFWWHKPAAVZBEL-UHFFFAOYSA-N
Data  1 IC50
  Tab Delimited (TSV)   2D SDfile   Computed 3D by Vconf -m prep SDfile
Find this compound or compounds like it in BindingDB:
Activity Spreadsheet -- Enzyme Inhibition Constant Data from BindingDB
Found 1 hit for monomerid = 77649
TargetMitochondrial import inner membrane translocase subunit TIM10(Saccharomyces cerevisiae S288c)
Burnham Center For Chemical Genomics
Curated by PubChem BioAssay
LigandPNGBDBM77649(3-[(2-hydroxy-3-methoxy-benzyl)amino]-2-(m-tolyl)q...)
Affinity DataIC50:  1.30E+4nM. Assay description: Data Source: Sanford-Burnham Center for Chemical Genomics (SBCCG) Source Affiliation: Sanford-Burnham Medical Research Institute(SBMRI, San Diego, CA...
In DepthDetails PCBioAssay