BDBM78135 MLS000555779::N-(4-Dimethylamino-phenyl)-3-[(pyridine-2-carbonyl)-hydrazono]-butyramide::N-[(E)-[3-[4-(dimethylamino)anilino]-3-keto-1-methyl-propylidene]amino]picolinamide::N-[[3-[4-(dimethylamino)anilino]-3-keto-1-methyl-propylidene]amino]picolinamide::N-[[4-[4-(dimethylamino)anilino]-4-oxobutan-2-ylidene]amino]-2-pyridinecarboxamide::N-[[4-[4-(dimethylamino)anilino]-4-oxobutan-2-ylidene]amino]pyridine-2-carboxamide::N-[[4-[[4-(dimethylamino)phenyl]amino]-4-oxidanylidene-butan-2-ylidene]amino]pyridine-2-carboxamide::SMR000174919::cid_3105722
SMILES CN(C)c1ccc(NC(=O)CC(C)=NNC(=O)c2ccccn2)cc1
InChI Key InChIKey=LITRKAVTZSYDIJ-UHFFFAOYSA-N
Data  2 IC50
  Tab Delimited (TSV)   2D SDfile   Computed 3D by Vconf -m prep SDfile
Find this compound or compounds like it in BindingDB:
Activity Spreadsheet -- Enzyme Inhibition Constant Data from BindingDB
Found 2 hits for monomerid = 78135
TargetProtein artemis(Homo sapiens (Human))
Burnham Center For Chemical Genomics
Curated by PubChem BioAssay
LigandPNGBDBM78135(MLS000555779 | N-(4-Dimethylamino-phenyl)-3-[(pyri...)
Affinity DataIC50:  2.00E+4nM. Assay description: Data Source: Sanford-Burnham Center for Chemical Genomics (SBCCG) Source Affiliation: Sanford-Burnham Medical Research Institute (SBMRI, San Diego CA...
In DepthDetails PCBioAssay
TargetMitochondrial import inner membrane translocase subunit TIM10(Saccharomyces cerevisiae S288c)
Burnham Center For Chemical Genomics
Curated by PubChem BioAssay
LigandPNGBDBM78135(MLS000555779 | N-(4-Dimethylamino-phenyl)-3-[(pyri...)
Affinity DataIC50:  5.45E+4nM. Assay description: Data Source: Sanford-Burnham Center for Chemical Genomics (SBCCG) Source Affiliation: Sanford-Burnham Medical Research Institute(SBMRI, San Diego, CA...
In DepthDetails PCBioAssay