BDBM78265 2-({1-[3-(methoxycarbonyl)-4,5,6,7-tetrahydro-1-benzothien-2-yl]-2,5-dioxo-3-pyrrolidinyl}thio)benzoic acid::2-[1-(3-methoxycarbonyl-4,5,6,7-tetrahydro-1-benzothiophen-2-yl)-2,5-bis(oxidanylidene)pyrrolidin-3-yl]sulfanylbenzoic acid::2-[1-(3-methoxycarbonyl-4,5,6,7-tetrahydro-1-benzothiophen-2-yl)-2,5-dioxopyrrolidin-3-yl]sulfanylbenzoic acid::2-[[1-(3-carbomethoxy-4,5,6,7-tetrahydrobenzothiophen-2-yl)-2,5-diketo-pyrrolidin-3-yl]thio]benzoic acid::2-[[1-(3-methoxycarbonyl-4,5,6,7-tetrahydro-1-benzothiophen-2-yl)-2,5-dioxo-3-pyrrolidinyl]thio]benzoic acid::MLS000676551::SMR000298619::cid_2906471
SMILES COC(=O)c1c2CCCCc2sc1-n1c(O)cc(Sc2ccccc2C(O)=O)c1O
InChI Key InChIKey=CEIWAOVIPSPEQW-UHFFFAOYSA-N
Data  2 IC50
  Tab Delimited (TSV)   2D SDfile   Computed 3D by Vconf -m prep SDfile
Find this compound or compounds like it in BindingDB:
Activity Spreadsheet -- Enzyme Inhibition Constant Data from BindingDB
Found 2 hits for monomerid = 78265
TargetMitochondrial import inner membrane translocase subunit TIM23(Saccharomyces cerevisiae S288c)
Burnham Center For Chemical Genomics
Curated by PubChem BioAssay
LigandPNGBDBM78265(2-({1-[3-(methoxycarbonyl)-4,5,6,7-tetrahydro-1-be...)
Affinity DataIC50:  3.13E+3nM. Assay description: Data Source: Sanford-Burnham Center for Chemical Genomics (SBCCG) Source Affiliation: Sanford-Burnham Medical Research Institute(SBMRI, San Diego, CA...
In DepthDetails PCBioAssay
TargetMitochondrial import inner membrane translocase subunit TIM10(Saccharomyces cerevisiae S288c)
Burnham Center For Chemical Genomics
Curated by PubChem BioAssay
LigandPNGBDBM78265(2-({1-[3-(methoxycarbonyl)-4,5,6,7-tetrahydro-1-be...)
Affinity DataIC50:  1.22E+4nM. Assay description: Data Source: Sanford-Burnham Center for Chemical Genomics (SBCCG) Source Affiliation: Sanford-Burnham Medical Research Institute(SBMRI, San Diego, CA...
In DepthDetails PCBioAssay