BDBM78292 MLS000622066::N-[4-(5-tert-butyl-1,2,3-triazol-1-yl)phenyl]-4-methoxy-benzamide::N-[4-(5-tert-butyl-1-triazolyl)phenyl]-4-methoxybenzamide::N-[4-(5-tert-butyl-1H-1,2,3-triazol-1-yl)phenyl]-4-methoxybenzamide::N-[4-(5-tert-butyltriazol-1-yl)phenyl]-4-methoxy-benzamide::N-[4-(5-tert-butyltriazol-1-yl)phenyl]-4-methoxybenzamide::SMR000310993::cid_4656417
SMILES COc1ccc(cc1)C(=O)Nc1ccc(cc1)-n1nncc1C(C)(C)C
InChI Key InChIKey=WNDSMKUDSOGQMQ-UHFFFAOYSA-N
Data  2 IC50
  Tab Delimited (TSV)   2D SDfile   Computed 3D by Vconf -m prep SDfile
Find this compound or compounds like it in BindingDB:
Activity Spreadsheet -- Enzyme Inhibition Constant Data from BindingDB
Found 2 hits for monomerid = 78292
TargetMitochondrial import inner membrane translocase subunit TIM23(Saccharomyces cerevisiae S288c)
Burnham Center For Chemical Genomics
Curated by PubChem BioAssay
LigandPNGBDBM78292(MLS000622066 | N-[4-(5-tert-butyl-1,2,3-triazol-1-...)
Affinity DataIC50:  8.87E+3nM. Assay description: Data Source: Sanford-Burnham Center for Chemical Genomics (SBCCG) Source Affiliation: Sanford-Burnham Medical Research Institute(SBMRI, San Diego, CA...
In DepthDetails PCBioAssay
TargetMitochondrial import inner membrane translocase subunit TIM10(Saccharomyces cerevisiae S288c)
Burnham Center For Chemical Genomics
Curated by PubChem BioAssay
LigandPNGBDBM78292(MLS000622066 | N-[4-(5-tert-butyl-1,2,3-triazol-1-...)
Affinity DataIC50:  1.64E+4nM. Assay description: Data Source: Sanford-Burnham Center for Chemical Genomics (SBCCG) Source Affiliation: Sanford-Burnham Medical Research Institute(SBMRI, San Diego, CA...
In DepthDetails PCBioAssay