BDBM78321 1-[1-(5-chloranylthiophen-2-yl)ethylideneamino]-3-(phenylmethyl)thiourea::1-[1-(5-chloro-2-thiophenyl)ethylideneamino]-3-(phenylmethyl)thiourea::1-benzyl-3-[1-(5-chloro-2-thienyl)ethylideneamino]thiourea::1-benzyl-3-[1-(5-chlorothiophen-2-yl)ethylideneamino]thiourea::MLS001033053::SMR000385527::cid_4216470
SMILES CC(=NNC(=S)NCc1ccccc1)c1ccc(Cl)s1
InChI Key InChIKey=LPMLLEOMADJENW-UHFFFAOYSA-N
Data  2 IC50
  Tab Delimited (TSV)   2D SDfile   Computed 3D by Vconf -m prep SDfile
Find this compound or compounds like it in BindingDB:
Activity Spreadsheet -- Enzyme Inhibition Constant Data from BindingDB
Found 2 hits for monomerid = 78321
TargetMitochondrial import inner membrane translocase subunit TIM23(Saccharomyces cerevisiae S288c)
Burnham Center For Chemical Genomics
Curated by PubChem BioAssay
LigandPNGBDBM78321(1-[1-(5-chloranylthiophen-2-yl)ethylideneamino]-3-...)
Affinity DataIC50:  1.75E+4nM. Assay description: Data Source: Sanford-Burnham Center for Chemical Genomics (SBCCG) Source Affiliation: Sanford-Burnham Medical Research Institute(SBMRI, San Diego, CA...
In DepthDetails PCBioAssay
TargetMitochondrial import inner membrane translocase subunit TIM10(Saccharomyces cerevisiae S288c)
Burnham Center For Chemical Genomics
Curated by PubChem BioAssay
LigandPNGBDBM78321(1-[1-(5-chloranylthiophen-2-yl)ethylideneamino]-3-...)
Affinity DataIC50:  1.64E+4nM. Assay description: Data Source: Sanford-Burnham Center for Chemical Genomics (SBCCG) Source Affiliation: Sanford-Burnham Medical Research Institute(SBMRI, San Diego, CA...
In DepthDetails PCBioAssay