BDBM78487 2-(4-chloranylphenoxy)-N-[5-(4-fluorophenyl)-1,3,4-oxadiazol-2-yl]ethanamide::2-(4-chlorophenoxy)-N-[5-(4-fluorophenyl)-1,3,4-oxadiazol-2-yl]acetamide::VU0405414-1::cid_3628914
SMILES Fc1ccc(cc1)-c1nnc(NC(=O)COc2ccc(Cl)cc2)o1
InChI Key InChIKey=HAGMEVSLNMNGQI-UHFFFAOYSA-N
Data  1 EC50
  Tab Delimited (TSV)   2D SDfile   Computed 3D by Vconf -m prep SDfile
Find this compound or compounds like it in BindingDB:
Activity Spreadsheet -- Enzyme Inhibition Constant Data from BindingDB
Found 1 hit for monomerid = 78487
TargetVoltage-dependent T-type calcium channel subunit alpha-1H(Homo sapiens (Human))
Vanderbilt Screening Center For Gpcrs, Ion Channels And Transporters
Curated by PubChem BioAssay
LigandPNGBDBM78487(2-(4-chloranylphenoxy)-N-[5-(4-fluorophenyl)-1,3,4...)
Affinity DataEC50:  1.80E+3nM. Assay description: Assay Provider: Xinmin Xie Assay Provider Affiliation: Bioscience Division, SRI International, Menlo Park, CA Grant Title: HTS Assay for Cav3 T-Type ...
In DepthDetails PCBioAssay