BDBM78491 2-(2-chloranyl-4-fluoranyl-phenoxy)-N-[(3S)-1-(phenylmethyl)piperidin-3-yl]ethanamide::2-(2-chloro-4-fluorophenoxy)-N-[(3S)-1-(phenylmethyl)-3-piperidinyl]acetamide::N-[(3S)-1-benzyl-3-piperidyl]-2-(2-chloro-4-fluoro-phenoxy)acetamide::N-[(3S)-1-benzylpiperidin-3-yl]-2-(2-chloro-4-fluorophenoxy)acetamide::VU0414820-1::cid_45115597
SMILES Fc1ccc(OCC(=O)N[C@H]2CCCN(Cc3ccccc3)C2)c(Cl)c1
InChI Key InChIKey=NXHQDLBPEDOBFJ-KRWDZBQOSA-N
Data  1 EC50
  Tab Delimited (TSV)   2D SDfile   Computed 3D by Vconf -m prep SDfile
Find this compound or compounds like it in BindingDB:
Activity Spreadsheet -- Enzyme Inhibition Constant Data from BindingDB
Found 1 hit for monomerid = 78491
TargetVoltage-dependent T-type calcium channel subunit alpha-1H(Homo sapiens (Human))
Vanderbilt Screening Center For Gpcrs, Ion Channels And Transporters
Curated by PubChem BioAssay
LigandPNGBDBM78491(2-(2-chloranyl-4-fluoranyl-phenoxy)-N-[(3S)-1-(phe...)
Affinity DataEC50:  1.00E+4nM. Assay description: Assay Provider: Xinmin Xie Assay Provider Affiliation: Bioscience Division, SRI International, Menlo Park, CA Grant Title: HTS Assay for Cav3 T-Type ...
In DepthDetails PCBioAssay