BDBM78897 4-[[(4R)-2-amino-3-(4-cyclohexylbutyl)-2-imidazolin-4-yl]methyl]phenol::4-[[(4R)-2-amino-3-(4-cyclohexylbutyl)-4,5-dihydroimidazol-4-yl]methyl]phenol::4-[[(4R)-2-azanyl-3-(4-cyclohexylbutyl)-4,5-dihydroimidazol-4-yl]methyl]phenol::MLS000888822::SMR000453297::cid_16682618
SMILES NC1=NC[C@@H](Cc2ccc(O)cc2)N1CCCCC1CCCCC1
InChI Key InChIKey=NITXILIYZADBDB-GOSISDBHSA-N
Data  2 IC50  2 EC50
  Tab Delimited (TSV)   2D SDfile   Computed 3D by Vconf -m prep SDfile
Find this compound or compounds like it in BindingDB:
Activity Spreadsheet -- Enzyme Inhibition Constant Data from BindingDB
Found 4 hits for monomerid = 78897
TargetUbiquitin-conjugating enzyme E2 N(Homo sapiens (Human))
Burnham Center For Chemical Genomics
Curated by PubChem BioAssay
LigandPNGBDBM78897(4-[[(4R)-2-amino-3-(4-cyclohexylbutyl)-2-imidazoli...)
Affinity DataIC50: >2.00E+4nM. Assay description: Data Source: Sanford-Burnham Center for Chemical Genomics (SBCCG) Source Affiliation: Sanford-Burnham Medical Research Institute (SBMRI, San Diego CA...
In DepthDetails PCBioAssay
TargetNeuropilin-1(Homo sapiens (Human))
Burnham Center For Chemical Genomics
Curated by PubChem BioAssay
LigandPNGBDBM78897(4-[[(4R)-2-amino-3-(4-cyclohexylbutyl)-2-imidazoli...)
Affinity DataIC50: >9.50E+4nM
In DepthDetails PCBioAssay
TargetDrug resistance protein 2(Candida albicans)
Nmmlsc
Curated by PubChem BioAssay
LigandPNGBDBM78897(4-[[(4R)-2-amino-3-(4-cyclohexylbutyl)-2-imidazoli...)
Affinity DataEC50:  1.63E+4nM. Assay description: UNMCMD Assay Overview: Assay Support: 1 R03 MH087406-01A1 Project Title: Identification of broad-spectrum antifungal efflux pump inhibitors ...
In DepthDetails PCBioAssay
TargetMultidrug resistance protein CDR2(Candida albicans)
Nmmlsc
Curated by PubChem BioAssay
LigandPNGBDBM78897(4-[[(4R)-2-amino-3-(4-cyclohexylbutyl)-2-imidazoli...)
Affinity DataEC50:  2.73E+4nM. Assay description: UNMCMD Assay Overview: Assay Support: 1 R03 MH087406-01A1 Project Title: Identification of broad-spectrum antifungal efflux pump inhibitors ...
In DepthDetails PCBioAssay