BDBM79118 MLS001158319::N'-(3-aminocarbonyl-5,5-dimethyl-4,7-dihydrothieno[2,3-c]pyran-2-yl)-N-(3-morpholin-4-ylpropyl)ethanediamide::N'-(3-carbamoyl-5,5-dimethyl-4,7-dihydrothieno[2,3-c]pyran-2-yl)-N-(3-morpholin-4-ylpropyl)oxamide::N'-(3-carbamoyl-5,5-dimethyl-4,7-dihydrothieno[2,3-c]pyran-2-yl)-N-(3-morpholinopropyl)oxamide::N'-(3-carbamoyl-5,5-dimethyl-4,7-dihydrothieno[2,3-c]pyran-2-yl)-N-[3-(4-morpholinyl)propyl]oxamide::SMR000652143::cid_17583803
SMILES CC1(C)Cc2c(CO1)sc(NC(=O)C(=O)NCCCN1CCOCC1)c2C(N)=O
InChI Key InChIKey=ZOTNHJHSYHCSTQ-UHFFFAOYSA-N
Data  3 IC50
  Tab Delimited (TSV)   2D SDfile   Computed 3D by Vconf -m prep SDfile
Find this compound or compounds like it in BindingDB:
Activity Spreadsheet -- Enzyme Inhibition Constant Data from BindingDB
Found 3 hits for monomerid = 79118
TargetBcl-2-related protein A1(Mus musculus (Mouse))
Burnham Center For Chemical Genomics
Curated by PubChem BioAssay
LigandPNGBDBM79118(MLS001158319 | N'-(3-aminocarbonyl-5,5-dimethyl-4,...)
Affinity DataIC50: >2.00E+4nM. Assay description: Data Source: Sanford-Burnham Center for Chemical Genomics (SBCCG) Source Affiliation: Sanford-Burnham Medical Research Institute (SBMRI, San Diego CA...
In DepthDetails PCBioAssay
TargetUbiquitin-conjugating enzyme E2 N(Homo sapiens (Human))
Burnham Center For Chemical Genomics
Curated by PubChem BioAssay
LigandPNGBDBM79118(MLS001158319 | N'-(3-aminocarbonyl-5,5-dimethyl-4,...)
Affinity DataIC50:  2.14E+3nM. Assay description: Data Source: Sanford-Burnham Center for Chemical Genomics (SBCCG) Source Affiliation: Sanford-Burnham Medical Research Institute (SBMRI, San Diego CA...
In DepthDetails PCBioAssay
TargetUbiquitin-conjugating enzyme E2 N(Homo sapiens (Human))
Burnham Center For Chemical Genomics
Curated by PubChem BioAssay
LigandPNGBDBM79118(MLS001158319 | N'-(3-aminocarbonyl-5,5-dimethyl-4,...)
Affinity DataIC50:  7.92E+3nM. Assay description: Data Source: Sanford-Burnham Center for Chemical Genomics (SBCCG) Source Affiliation: Sanford-Burnham Medical Research Institute (SBMRI, San Diego CA...
In DepthDetails PCBioAssay