BDBM79445 3-[(5Z)-5-(2-chlorobenzylidene)-4-keto-2-thioxo-thiazolidin-3-yl]propionic acid::3-[(5Z)-5-[(2-chlorophenyl)methylidene]-4-oxidanylidene-2-sulfanylidene-1,3-thiazolidin-3-yl]propanoic acid::3-[(5Z)-5-[(2-chlorophenyl)methylidene]-4-oxo-2-sulfanylidene-1,3-thiazolidin-3-yl]propanoic acid::3-[(5Z)-5-[(2-chlorophenyl)methylidene]-4-oxo-2-sulfanylidene-3-thiazolidinyl]propanoic acid::SR-03000001800::SR-03000001800-1::cid_1368297
SMILES OC(=O)CCN1C(=S)S\C(=C/c2ccccc2Cl)C1=O
InChI Key InChIKey=LKWJDVJMIFOUHG-YFHOEESVSA-N
Data  1 IC50
  Tab Delimited (TSV)   2D SDfile   Computed 3D by Vconf -m prep SDfile
Find this compound or compounds like it in BindingDB:
Activity Spreadsheet -- Enzyme Inhibition Constant Data from BindingDB
Found 1 hit for monomerid = 79445
TargetPeroxisome proliferator-activated receptor gamma(Homo sapiens (Human))
The Scripps Research Institute Molecular Screening Center
Curated by PubChem BioAssay
LigandPNGBDBM79445(3-[(5Z)-5-(2-chlorobenzylidene)-4-keto-2-thioxo-th...)
Affinity DataIC50:  2.00E+3nM. Assay description: Source (MLPCN Center Name): The Scripps Research Institute Molecular Screening Center (SRISMC) Center Affiliation: The Scripps Research Institute, TS...
In DepthDetails PCBioAssay