BDBM79454 1-(4-ethoxyphenyl)-2-[(1-pyrimidin-2-ylpyrrol-2-yl)methyl]-1,3,4,9-tetrahydropyrido[3,4-b]indole::1-(4-ethoxyphenyl)-2-[[1-(2-pyrimidinyl)-2-pyrrolyl]methyl]-1,3,4,9-tetrahydropyrido[3,4-b]indole::1-p-phenetyl-2-[[1-(2-pyrimidyl)pyrrol-2-yl]methyl]-1,3,4,9-tetrahydro-beta-carboline::SR-01000774798::SR-01000774798-1::cid_16187277
SMILES CCOc1ccc(cc1)C1N(Cc2cccn2-c2ncccn2)CCc2c1[nH]c1ccccc21
InChI Key InChIKey=YVYBIVIJPRIYAZ-UHFFFAOYSA-N
Data  1 EC50
  Tab Delimited (TSV)   2D SDfile   Computed 3D by Vconf -m prep SDfile
Find this compound or compounds like it in BindingDB:
Activity Spreadsheet -- Enzyme Inhibition Constant Data from BindingDB
Found 1 hit for monomerid = 79454
TargetPeroxisome proliferator-activated receptor gamma(Homo sapiens (Human))
The Scripps Research Institute Molecular Screening Center
Curated by PubChem BioAssay
LigandPNGBDBM79454(1-(4-ethoxyphenyl)-2-[(1-pyrimidin-2-ylpyrrol-2-yl...)
Affinity DataEC50:  1.60E+3nM. Assay description: Source (MLPCN Center Name): The Scripps Research Institute Molecular Screening Center (SRISMC) Center Affiliation: The Scripps Research Institute, TS...
In DepthDetails PCBioAssay