BDBM79461 1-benzyl-5-chloro-3-methyl-pyrazole-4-carboxylic acid [2-(4-ethylanilino)-2-keto-1-methyl-ethyl] ester::5-chloro-3-methyl-1-(phenylmethyl)-4-pyrazolecarboxylic acid [1-(4-ethylanilino)-1-oxopropan-2-yl] ester::SR-01000698447::SR-01000698447-2::[1-(4-ethylanilino)-1-oxopropan-2-yl] 1-benzyl-5-chloro-3-methylpyrazole-4-carboxylate::[1-[(4-ethylphenyl)amino]-1-oxidanylidene-propan-2-yl] 5-chloranyl-3-methyl-1-(phenylmethyl)pyrazole-4-carboxylate::cid_3324089
SMILES CCc1ccc(NC(=O)C(C)OC(=O)c2c(C)nn(Cc3ccccc3)c2Cl)cc1
InChI Key InChIKey=CMESBGDQHPKECY-UHFFFAOYSA-N
Data  2 EC50
  Tab Delimited (TSV)   2D SDfile   Computed 3D by Vconf -m prep SDfile
Find this compound or compounds like it in BindingDB:
Activity Spreadsheet -- Enzyme Inhibition Constant Data from BindingDB
Found 2 hits for monomerid = 79461
TargetSphingosine 1-phosphate receptor 4(Homo sapiens (Human))
The Scripps Research Institute Molecular Screening Center
Curated by PubChem BioAssay
LigandPNGBDBM79461(1-benzyl-5-chloro-3-methyl-pyrazole-4-carboxylic a...)
Affinity DataEC50: >5.00E+4nM. Assay description: Source (MLSCN Center Name): The Scripps Research Institute Molecular Screening Center Center Affiliation: The Scripps Research Institute (TSRI) Assay...
In DepthDetails PCBioAssay
TargetSphingosine 1-phosphate receptor 4(Homo sapiens (Human))
The Scripps Research Institute Molecular Screening Center
Curated by PubChem BioAssay
LigandPNGBDBM79461(1-benzyl-5-chloro-3-methyl-pyrazole-4-carboxylic a...)
Affinity DataEC50: >5.00E+4nM. Assay description: Source (MLSCN Center Name): The Scripps Research Institute Molecular Screening Center Center Affiliation: The Scripps Research Institute (TSRI) Assay...
In DepthDetails PCBioAssay