BDBM79483 1-benzyl-5-chloro-3-methyl-pyrazole-4-carboxylic acid [2-keto-1-methyl-2-(2-thenylamino)ethyl] ester::5-chloro-3-methyl-1-(phenylmethyl)-4-pyrazolecarboxylic acid [1-oxo-1-(thiophen-2-ylmethylamino)propan-2-yl] ester::SR-02000000324::SR-02000000324-1::[1-oxidanylidene-1-(thiophen-2-ylmethylamino)propan-2-yl] 5-chloranyl-3-methyl-1-(phenylmethyl)pyrazole-4-carboxylate::[1-oxo-1-(thiophen-2-ylmethylamino)propan-2-yl] 1-benzyl-5-chloro-3-methylpyrazole-4-carboxylate::cid_44640167
SMILES CC(OC(=O)c1c(C)nn(Cc2ccccc2)c1Cl)C(=O)NCc1cccs1
InChI Key InChIKey=LDBRSFCXNZWQQU-UHFFFAOYSA-N
Data  1 EC50
  Tab Delimited (TSV)   2D SDfile   Computed 3D by Vconf -m prep SDfile
Find this compound or compounds like it in BindingDB:
Activity Spreadsheet -- Enzyme Inhibition Constant Data from BindingDB
Found 1 hit for monomerid = 79483
TargetSphingosine 1-phosphate receptor 4(Homo sapiens (Human))
The Scripps Research Institute Molecular Screening Center
Curated by PubChem BioAssay
LigandPNGBDBM79483(1-benzyl-5-chloro-3-methyl-pyrazole-4-carboxylic a...)
Affinity DataEC50: >5.00E+4nM. Assay description: Source (MLSCN Center Name): The Scripps Research Institute Molecular Screening Center Center Affiliation: The Scripps Research Institute (TSRI) Assay...
In DepthDetails PCBioAssay