BDBM79506 3-(4-bromophenyl)sulfonyl-N-(3-ethylphenyl)propanamide::3-[(4-bromophenyl)sulfonyl]-N-(3-ethylphenyl)propanamide::3-brosyl-N-(3-ethylphenyl)propionamide::MLS001202277::SMR000564971::cid_4104622
SMILES CCc1cccc(NC(=O)CCS(=O)(=O)c2ccc(Br)cc2)c1
InChI Key InChIKey=BGTAGOPNOZXAMC-UHFFFAOYSA-N
Data  1 IC50  1 EC50
  Tab Delimited (TSV)   2D SDfile   Computed 3D by Vconf -m prep SDfile
Find this compound or compounds like it in BindingDB:
Activity Spreadsheet -- Enzyme Inhibition Constant Data from BindingDB
Found 2 hits for monomerid = 79506
TargetCarboxy-terminal domain RNA polymerase II polypeptide A small phosphatase 1(Homo sapiens (Human))
Burnham Center For Chemical Genomics
Curated by PubChem BioAssay
LigandPNGBDBM79506(3-(4-bromophenyl)sulfonyl-N-(3-ethylphenyl)propana...)
Affinity DataIC50:  6.99E+3nM. Assay description: Data Source: Sanford-Burnham Center for Chemical Genomics (SBCCG) Source Affiliation: Sanford-Burnham Medical Research Institute (SBMRI, San Diego, C...
In DepthDetails PCBioAssay
TargetBeta-adrenergic receptor kinase 1(Homo sapiens (Human))
Nmmlsc
Curated by PubChem BioAssay
LigandPNGBDBM79506(3-(4-bromophenyl)sulfonyl-N-(3-ethylphenyl)propana...)
Affinity DataEC50:  5.83E+4nM. Assay description: University of New Mexico Assay Overview: Assay Support: 1 R03 DA030557-01A1 Project Title: RNA Aptamer-based screen for Selective Inhibitors of ...
In DepthDetails PCBioAssay