BDBM79507 3-(4-bromophenyl)sulfonyl-N-[4-(diethylamino)-2-methyl-phenyl]propanamide::3-(4-bromophenyl)sulfonyl-N-[4-(diethylamino)-2-methylphenyl]propanamide::3-[(4-bromophenyl)sulfonyl]-N-[4-(diethylamino)-2-methylphenyl]propanamide::3-brosyl-N-[4-(diethylamino)-2-methyl-phenyl]propionamide::MLS001202313::SMR000564974::cid_4109100
SMILES CCN(CC)c1ccc(NC(=O)CCS(=O)(=O)c2ccc(Br)cc2)c(C)c1
InChI Key InChIKey=URHMXWPKHKUPTM-UHFFFAOYSA-N
Data  2 IC50  1 EC50
  Tab Delimited (TSV)   2D SDfile   Computed 3D by Vconf -m prep SDfile
Find this compound or compounds like it in BindingDB:
Activity Spreadsheet -- Enzyme Inhibition Constant Data from BindingDB
Found 3 hits for monomerid = 79507
TargetBeta-adrenergic receptor kinase 1(Homo sapiens (Human))
Nmmlsc
Curated by PubChem BioAssay
LigandPNGBDBM79507(3-(4-bromophenyl)sulfonyl-N-[4-(diethylamino)-2-me...)
Affinity DataEC50:  5.01E+3nM. Assay description: University of New Mexico Assay Overview: Assay Support: 1 R03 DA030557-01A1 Project Title: RNA Aptamer-based screen for Selective Inhibitors of ...
In DepthDetails PCBioAssay
TargetDNA (cytosine-5)-methyltransferase 1(Homo sapiens (Human))
Burnham Center For Chemical Genomics
Curated by PubChem BioAssay
LigandPNGBDBM79507(3-(4-bromophenyl)sulfonyl-N-[4-(diethylamino)-2-me...)
Affinity DataIC50:  8.64E+3nM. Assay description: Data Source: Sanford-Burnham Center for Chemical Genomics (SBCCG) Source Affiliation: Sanford-Burnham Medical Research Institute (SBMRI, San Diego, C...
In DepthDetails PCBioAssay
TargetCarboxy-terminal domain RNA polymerase II polypeptide A small phosphatase 1(Homo sapiens (Human))
Burnham Center For Chemical Genomics
Curated by PubChem BioAssay
LigandPNGBDBM79507(3-(4-bromophenyl)sulfonyl-N-[4-(diethylamino)-2-me...)
Affinity DataIC50:  3.04E+3nM. Assay description: Data Source: Sanford-Burnham Center for Chemical Genomics (SBCCG) Source Affiliation: Sanford-Burnham Medical Research Institute (SBMRI, San Diego, C...
In DepthDetails PCBioAssay