BDBM79525 MLS000538560::N-[3-chloranyl-4-[4-(2-methylpropanoyl)piperazin-1-yl]phenyl]-2,3-dihydro-1,4-benzodioxine-6-carboxamide::N-[3-chloro-4-(4-isobutyryl-1-piperazinyl)phenyl]-2,3-dihydro-1,4-benzodioxine-6-carboxamide::N-[3-chloro-4-(4-isobutyrylpiperazino)phenyl]-2,3-dihydro-1,4-benzodioxin-6-carboxamide::N-[3-chloro-4-[4-(2-methyl-1-oxopropyl)-1-piperazinyl]phenyl]-2,3-dihydro-1,4-benzodioxin-6-carboxamide::N-[3-chloro-4-[4-(2-methylpropanoyl)piperazin-1-yl]phenyl]-2,3-dihydro-1,4-benzodioxine-6-carboxamide::SMR000144597::cid_1255859
SMILES CC(C)C(=O)N1CCN(CC1)c1ccc(NC(=O)c2ccc3OCCOc3c2)cc1Cl
InChI Key InChIKey=XLXRROIVENNXDG-UHFFFAOYSA-N
Data  1 EC50
  Tab Delimited (TSV)   2D SDfile   Computed 3D by Vconf -m prep SDfile
Find this compound or compounds like it in BindingDB:
Activity Spreadsheet -- Enzyme Inhibition Constant Data from BindingDB
Found 1 hit for monomerid = 79525
TargetNeurotensin receptor type 1(Homo sapiens (Human))
Burnham Center For Chemical Genomics
Curated by PubChem BioAssay
LigandPNGBDBM79525(MLS000538560 | N-[3-chloranyl-4-[4-(2-methylpropan...)
Affinity DataEC50:  1.85E+4nM. Assay description: Data Source: Sanford-Burnham Center for Chemical Genomics (SBCCG) Source Affiliation: Sanford-Burnham Medical Research Institute (SBMRI, San Diego, C...
In DepthDetails PCBioAssay