BDBM79571 3-(2,5-dioxo-1-pyrrolidinyl)-N-(4-methoxy-3-prop-2-enyl-1,3-benzothiazol-2-ylidene)benzamide::3-(2,5-dioxopyrrolidin-1-yl)-N-(4-methoxy-3-prop-2-enyl-1,3-benzothiazol-2-ylidene)benzamide::3-[2,5-bis(oxidanylidene)pyrrolidin-1-yl]-N-(4-methoxy-3-prop-2-enyl-1,3-benzothiazol-2-ylidene)benzamide::MLS000419543::N-(3-allyl-4-methoxy-1,3-benzothiazol-2-ylidene)-3-succinimido-benzamide::SMR000320287::cid_2151229
SMILES COc1cccc2sc(=NC(=O)c3cccc(c3)-n3c(O)ccc3O)n(CC=C)c12
InChI Key InChIKey=SIAIPPHCRLOICO-UHFFFAOYSA-N
Data  1 EC50
  Tab Delimited (TSV)   2D SDfile   Computed 3D by Vconf -m prep SDfile
Find this compound or compounds like it in BindingDB:
Activity Spreadsheet -- Enzyme Inhibition Constant Data from BindingDB
Found 1 hit for monomerid = 79571
TargetNeurotensin receptor type 1(Homo sapiens (Human))
Burnham Center For Chemical Genomics
Curated by PubChem BioAssay
LigandPNGBDBM79571(3-(2,5-dioxo-1-pyrrolidinyl)-N-(4-methoxy-3-prop-2...)
Affinity DataEC50: >4.00E+4nM. Assay description: Data Source: Sanford-Burnham Center for Chemical Genomics (SBCCG) Source Affiliation: Sanford-Burnham Medical Research Institute (SBMRI, San Diego, C...
In DepthDetails PCBioAssay