BDBM79617 2-(3,5-dimethyl-1-piperidinyl)-4-methylquinoline;2,2,2-trifluoroacetic acid::2-(3,5-dimethylpiperidin-1-yl)-4-methyl-quinoline;2,2,2-tris(fluoranyl)ethanoic acid::2-(3,5-dimethylpiperidin-1-yl)-4-methylquinoline;2,2,2-trifluoroacetic acid::2-(3,5-dimethylpiperidino)-4-methyl-quinoline;2,2,2-trifluoroacetic acid::VU0418905-1::cid_46259331
SMILES CC1CC(C)CN(C1)c1cc(C)c2ccccc2n1
InChI Key InChIKey=LHEWMRUHWKVUKI-UHFFFAOYSA-N
Data  1 IC50
  Tab Delimited (TSV)   2D SDfile   Computed 3D by Vconf -m prep SDfile
Find this compound or compounds like it in BindingDB:
Activity Spreadsheet -- Enzyme Inhibition Constant Data from BindingDB
Found 1 hit for monomerid = 79617
TargetShort transient receptor potential channel 4(Mus musculus)
Johns Hopkins Ion Channel Center
Curated by PubChem BioAssay
LigandPNGBDBM79617(2-(3,5-dimethyl-1-piperidinyl)-4-methylquinoline;2...)
Affinity DataIC50:  1.19E+4nM. Assay description: The inhibitory effects of test compounds on TRPC4 channels were evaluated in electrophysiological assays using a QPatch16 automated electrophysiology...
In DepthDetails PCBioAssay