BDBM79641 (5Z)-3-ethyl-5-(indolin-1-ylmethylene)-2-thioxo-thiazolidin-4-one::(5Z)-5-(2,3-dihydroindol-1-ylmethylidene)-3-ethyl-2-sulfanylidene-1,3-thiazolidin-4-one::(5Z)-5-(2,3-dihydroindol-1-ylmethylidene)-3-ethyl-2-sulfanylidene-4-thiazolidinone::MLS000080529::SMR000037442::cid_663616
SMILES CCN1C(=S)S\C(=C/N2CCc3ccccc23)C1=O
InChI Key InChIKey=BTUYWZKZEVCQCO-XFXZXTDPSA-N
Data  1 EC50
  Tab Delimited (TSV)   2D SDfile   Computed 3D by Vconf -m prep SDfile
Find this compound or compounds like it in BindingDB:
Activity Spreadsheet -- Enzyme Inhibition Constant Data from BindingDB
Found 1 hit for monomerid = 79641
TargetTropomyosin alpha-1 chain(Sus scrofa)
The Scripps Research Institute Molecular Screening Center
Curated by PubChem BioAssay
LigandPNGBDBM79641((5Z)-3-ethyl-5-(indolin-1-ylmethylene)-2-thioxo-th...)
Affinity DataEC50:  5.40E+3nM. Assay description: Source (MLPCN Center Name): The Scripps Research Institute Molecular Screening Center (SRIMSC) Affiliation: The Scripps Research Institute, TSRI Assa...
In DepthDetails PCBioAssay