BDBM79657 MLS000121109::N-(3-Cyano-4,5-dimethyl-thiophen-2-yl)-2-(5-isopropyl-4-methyl-4H-[1,2,4]triazol-3-ylsulfanyl)-acetamide::N-(3-cyano-4,5-dimethyl-2-thienyl)-2-[(5-isopropyl-4-methyl-1,2,4-triazol-3-yl)thio]acetamide::N-(3-cyano-4,5-dimethyl-2-thiophenyl)-2-[(4-methyl-5-propan-2-yl-1,2,4-triazol-3-yl)thio]acetamide::N-(3-cyano-4,5-dimethyl-thiophen-2-yl)-2-[(4-methyl-5-propan-2-yl-1,2,4-triazol-3-yl)sulfanyl]ethanamide::N-(3-cyano-4,5-dimethylthiophen-2-yl)-2-[(4-methyl-5-propan-2-yl-1,2,4-triazol-3-yl)sulfanyl]acetamide::SMR000118594::cid_855191
SMILES CC(C)c1nnc(SCC(=O)Nc2sc(C)c(C)c2C#N)n1C
InChI Key InChIKey=IKWKFZMCHJLITB-UHFFFAOYSA-N
Data  1 EC50
  Tab Delimited (TSV)   2D SDfile   Computed 3D by Vconf -m prep SDfile
Find this compound or compounds like it in BindingDB:
Activity Spreadsheet -- Enzyme Inhibition Constant Data from BindingDB
Found 1 hit for monomerid = 79657
TargetTropomyosin alpha-1 chain(Sus scrofa)
The Scripps Research Institute Molecular Screening Center
Curated by PubChem BioAssay
LigandPNGBDBM79657(MLS000121109 | N-(3-Cyano-4,5-dimethyl-thiophen-2-...)
Affinity DataEC50: >7.15E+4nM. Assay description: Source (MLPCN Center Name): The Scripps Research Institute Molecular Screening Center (SRIMSC) Affiliation: The Scripps Research Institute, TSRI Assa...
In DepthDetails PCBioAssay