BDBM79682 2-(6-Bromo-3H-imidazo[4,5-b]pyridin-2-ylsulfanyl)-1-(3-nitro-phenyl)-ethanone::2-[(6-bromanyl-1H-imidazo[4,5-b]pyridin-2-yl)sulfanyl]-1-(3-nitrophenyl)ethanone::2-[(6-bromo-1H-imidazo[4,5-b]pyridin-2-yl)sulfanyl]-1-(3-nitrophenyl)ethanone::2-[(6-bromo-1H-imidazo[4,5-b]pyridin-2-yl)thio]-1-(3-nitrophenyl)ethanone::MLS000580250::SMR000220500::cid_1422364
SMILES [O-][N+](=O)c1cccc(c1)C(=O)CSc1nc2ncc(Br)cc2[nH]1
InChI Key InChIKey=LLMQDIQQXCJSHY-UHFFFAOYSA-N
Data  1 EC50
  Tab Delimited (TSV)   2D SDfile   Computed 3D by Vconf -m prep SDfile
Find this compound or compounds like it in BindingDB:
Activity Spreadsheet -- Enzyme Inhibition Constant Data from BindingDB
Found 1 hit for monomerid = 79682
TargetTropomyosin alpha-1 chain(Sus scrofa)
The Scripps Research Institute Molecular Screening Center
Curated by PubChem BioAssay
LigandPNGBDBM79682(2-(6-Bromo-3H-imidazo[4,5-b]pyridin-2-ylsulfanyl)-...)
Affinity DataEC50: >7.15E+4nM. Assay description: Source (MLPCN Center Name): The Scripps Research Institute Molecular Screening Center (SRIMSC) Affiliation: The Scripps Research Institute, TSRI Assa...
In DepthDetails PCBioAssay