BDBM79685 (E)-2-Acetylamino-3-(1H-indol-3-yl)-acrylic acid ethyl ester::(E)-2-acetamido-3-(1H-indol-3-yl)-2-propenoic acid ethyl ester::(E)-2-acetamido-3-(1H-indol-3-yl)acrylic acid ethyl ester::MLS000331701::SMR000220808::cid_6390914::ethyl (E)-2-acetamido-3-(1H-indol-3-yl)prop-2-enoate
SMILES CCOC(=O)C(\NC(C)=O)=C/c1c[nH]c2ccccc12
InChI Key InChIKey=RURYKVASRBINOW-RIYZIHGNSA-N
Data  1 EC50
  Tab Delimited (TSV)   2D SDfile   Computed 3D by Vconf -m prep SDfile
Find this compound or compounds like it in BindingDB:
Activity Spreadsheet -- Enzyme Inhibition Constant Data from BindingDB
Found 1 hit for monomerid = 79685
TargetTropomyosin alpha-1 chain(Sus scrofa)
The Scripps Research Institute Molecular Screening Center
Curated by PubChem BioAssay
LigandPNGBDBM79685((E)-2-Acetylamino-3-(1H-indol-3-yl)-acrylic acid e...)
Affinity DataEC50: >7.14E+4nM. Assay description: Source (MLPCN Center Name): The Scripps Research Institute Molecular Screening Center (SRIMSC) Affiliation: The Scripps Research Institute, TSRI Assa...
In DepthDetails PCBioAssay