BDBM79913 (4aS,8R,8aS)-N-[4-chloranyl-3-(trifluoromethyl)phenyl]-2-[(3,4-dimethoxyphenyl)methyl]-1-oxidanylidene-3,4,4a,7,8,8a-hexahydroisoquinoline-8-carboxamide::(4aS,8R,8aS)-N-[4-chloro-3-(trifluoromethyl)phenyl]-1-keto-2-veratryl-3,4,4a,7,8,8a-hexahydroisoquinoline-8-carboxamide::(4aS,8R,8aS)-N-[4-chloro-3-(trifluoromethyl)phenyl]-2-[(3,4-dimethoxyphenyl)methyl]-1-oxo-3,4,4a,7,8,8a-hexahydroisoquinoline-8-carboxamide::MLS000882850::SMR000525481::cid_24747492
SMILES COc1ccc(CN2CC[C@H]3C=CC[C@H]([C@H]3C2=O)C(=O)Nc2ccc(Cl)c(c2)C(F)(F)F)cc1OC
InChI Key InChIKey=CKTQSZLJZDVMBM-UQNRQAKVSA-N
Data  2 IC50
  Tab Delimited (TSV)   2D SDfile   Computed 3D by Vconf -m prep SDfile
Find this compound or compounds like it in BindingDB:
Activity Spreadsheet -- Enzyme Inhibition Constant Data from BindingDB
Found 2 hits for monomerid = 79913
TargetOrexin/Hypocretin receptor type 1(Homo sapiens (Human))
The Scripps Research Institute Molecular Screening Center
Curated by PubChem BioAssay
LigandPNGBDBM79913((4aS,8R,8aS)-N-[4-chloranyl-3-(trifluoromethyl)phe...)
Affinity DataIC50:  3.22E+3nM. Assay description: Source (MLPCN Center Name): The Scripps Research Institute Molecular Screening Center (SRIMSC) Affiliation: The Scripps Research Institute, TSRI Assa...
Ligand InfoPC cidPC sid
In DepthDetails PCBioAssay
TargetOrexin/Hypocretin receptor type 1(Homo sapiens (Human))
The Scripps Research Institute Molecular Screening Center
Curated by PubChem BioAssay
LigandPNGBDBM79913((4aS,8R,8aS)-N-[4-chloranyl-3-(trifluoromethyl)phe...)
Affinity DataIC50:  71.0nM. Assay description: Source (MLPCN Center Name): The Scripps Research Institute Molecular Screening Center (SRIMSC) Affiliation: The Scripps Research Institute, TSRI Assa...
Ligand InfoPC cidPC sid
In DepthDetails PCBioAssay