BDBM79927 MLS000937074::N-(3-methylsulfanylphenyl)-1-thiophen-2-ylsulfonyl-piperidine-3-carboxamide::N-(3-methylsulfanylphenyl)-1-thiophen-2-ylsulfonylpiperidine-3-carboxamide::N-[3-(methylthio)phenyl]-1-(2-thienylsulfonyl)nipecotamide::N-[3-(methylthio)phenyl]-1-thiophen-2-ylsulfonyl-3-piperidinecarboxamide::SMR000621864::cid_22429402
SMILES CSc1cccc(NC(=O)C2CCCN(C2)S(=O)(=O)c2cccs2)c1
InChI Key InChIKey=LZCBNRHAAUTAMM-UHFFFAOYSA-N
Data  2 IC50
  Tab Delimited (TSV)   2D SDfile   Computed 3D by Vconf -m prep SDfile
Find this compound or compounds like it in BindingDB:
Activity Spreadsheet -- Enzyme Inhibition Constant Data from BindingDB
Found 2 hits for monomerid = 79927
TargetOrexin/Hypocretin receptor type 1(Homo sapiens (Human))
The Scripps Research Institute Molecular Screening Center
Curated by PubChem BioAssay
LigandPNGBDBM79927(MLS000937074 | N-(3-methylsulfanylphenyl)-1-thioph...)
Affinity DataIC50:  6.41E+3nM. Assay description: Source (MLPCN Center Name): The Scripps Research Institute Molecular Screening Center (SRIMSC) Affiliation: The Scripps Research Institute, TSRI Assa...
In DepthDetails PCBioAssay
TargetOrexin/Hypocretin receptor type 1(Homo sapiens (Human))
The Scripps Research Institute Molecular Screening Center
Curated by PubChem BioAssay
LigandPNGBDBM79927(MLS000937074 | N-(3-methylsulfanylphenyl)-1-thioph...)
Affinity DataIC50:  546nM. Assay description: Source (MLPCN Center Name): The Scripps Research Institute Molecular Screening Center (SRIMSC) Affiliation: The Scripps Research Institute, TSRI Assa...
In DepthDetails PCBioAssay