BDBM80023 2-[2-[5,7-bis(chloranyl)-2-methyl-quinolin-8-yl]oxyethanoyl-ethyl-amino]-N-tert-butyl-ethanamide::MLS001019021::N-tert-butyl-2-[[2-(5,7-dichloro-2-methylquinolin-8-yl)oxyacetyl]-ethylamino]acetamide::N-tert-butyl-2-[[2-[(5,7-dichloro-2-methyl-8-quinolinyl)oxy]-1-oxoethyl]-ethylamino]acetamide::N-tert-butyl-2-[[2-[(5,7-dichloro-2-methyl-8-quinolyl)oxy]acetyl]-ethyl-amino]acetamide::SMR000363357::cid_2442939
SMILES CCN(CC(=O)NC(C)(C)C)C(=O)COc1c(Cl)cc(Cl)c2ccc(C)nc12
InChI Key InChIKey=HKJFGEXDSONTPW-UHFFFAOYSA-N
Data  2 IC50
  Tab Delimited (TSV)   2D SDfile   Computed 3D by Vconf -m prep SDfile
Find this compound or compounds like it in BindingDB:
Activity Spreadsheet -- Enzyme Inhibition Constant Data from BindingDB
Found 2 hits for monomerid = 80023
TargetC-C chemokine receptor type 6(Homo sapiens (Human))
Burnham Center For Chemical Genomics
Curated by PubChem BioAssay
LigandPNGBDBM80023(2-[2-[5,7-bis(chloranyl)-2-methyl-quinolin-8-yl]ox...)
Affinity DataIC50:  2.06E+4nM. Assay description: Data Source: Sanford-Burnham Center for Chemical Genomics (SBCCG) Source Affiliation: Sanford-Burnham Medical Research Institute(SBMRI, San Diego, CA...
In DepthDetails PCBioAssay
TargetBeta-galactosidase(Escherichia coli)
Burnham Center For Chemical Genomics
Curated by PubChem BioAssay
LigandPNGBDBM80023(2-[2-[5,7-bis(chloranyl)-2-methyl-quinolin-8-yl]ox...)
Affinity DataIC50: >6.66E+4nM. Assay description: Data Source: Sanford-Burnham Center for Chemical Genomics (SBCCG) Source Affiliation: Sanford-Burnham Medical Research Institute(SBMRI, San Diego, C...
In DepthDetails PCBioAssay