BDBM80106 3-methoxy-N-[[4-(3-methylphenyl)-5-sulfanylidene-1H-1,2,4-triazol-3-yl]methyl]benzamide::3-methoxy-N-[[4-(m-tolyl)-5-thioxo-1H-1,2,4-triazol-3-yl]methyl]benzamide::3-methoxy-N-{[4-(3-methylphenyl)-5-thioxo-4,5-dihydro-1H-1,2,4-triazol-3-yl]methyl}benzamide::MLS000088524::SMR000024144::cid_3240676
SMILES COc1cccc(c1)C(=O)NCc1n[nH]c(=S)n1-c1cccc(C)c1
InChI Key InChIKey=RBKGLDKIANCLEK-UHFFFAOYSA-N
Data  2 IC50
  Tab Delimited (TSV)   2D SDfile   Computed 3D by Vconf -m prep SDfile
Find this compound or compounds like it in BindingDB:
Activity Spreadsheet -- Enzyme Inhibition Constant Data from BindingDB
Found 2 hits for monomerid = 80106
TargetDNA dC->dU-editing enzyme APOBEC-3A(Homo sapiens (Human))
Burnham Center For Chemical Genomics
Curated by PubChem BioAssay
LigandPNGBDBM80106(3-methoxy-N-[[4-(3-methylphenyl)-5-sulfanylidene-1...)
Affinity DataIC50: >1.00E+5nMT: 2°C. Assay description: Data Source: Sanford-Burnham Center for Chemical Genomics (SBCCG) Source Affiliation: Sanford-Burnham Medical Research Institute (SBMRI, San Diego, C...
In DepthDetails PCBioAssay
TargetDNA dC->dU-editing enzyme APOBEC-3G(Homo sapiens (Human))
Burnham Center For Chemical Genomics
Curated by PubChem BioAssay
LigandPNGBDBM80106(3-methoxy-N-[[4-(3-methylphenyl)-5-sulfanylidene-1...)
Affinity DataIC50:  1.28E+4nMT: 2°C. Assay description: Data Source: Sanford-Burnham Center for Chemical Genomics (SBCCG) Source Affiliation: Sanford-Burnham Medical Research Institute (SBMRI, San Diego, C...
In DepthDetails PCBioAssay